report.html

Report generated on 03-Mar-2020 at 00:26:06 by pytest-html v2.0.1

Environment

Packages {'pytest': '5.3.5', 'py': '1.8.0', 'pluggy': '0.12.0'}
Platform Linux-5.5.5-200.fc31.x86_64-x86_64-with-fedora-31-Thirty_One
Plugins {'metadata': '1.8.0', 'html': '2.0.1', 'multihost': '3.0', 'sourceorder': '0.5'}
Python 3.7.6

Summary

11 tests ran in 1091.38 seconds.

11 passed, 0 skipped, 0 failed, 0 errors, 0 expected failures, 0 unexpected passes

Results

Result Test Duration Links
Passed test_integration/test_smb.py::TestSMB::test_samba_uninstallation_without_installation 0.98
-----------------------------Captured stdout setup------------------------------
<ipatests.pytest_ipa.integration.config.Config object at 0x7fce2dbe8bd0>
-----------------------------Captured stderr setup------------------------------
[ipatests.pytest_ipa.integration.host.Host.master.ParamikoTransport] RUN ['ipa', 'dnsrecord-show', 'ipa.test', 'client1.ipa.test.'] [ipatests.pytest_ipa.integration.host.Host.master.cmd30] RUN ['ipa', 'dnsrecord-show', 'ipa.test', 'client1.ipa.test.'] [ipatests.pytest_ipa.integration.host.Host.master.cmd30] ipa: ERROR: client1.ipa.test.: DNS resource record not found [ipatests.pytest_ipa.integration.host.Host.master.cmd30] Exit code: 2 [ipatests.pytest_ipa.integration.host.Host.master.ParamikoTransport] RUN ['ipa', 'dnsrecord-add', 'ipa.test', 'client1.ipa.test.', '--a-rec', '192.168.122.221'] [ipatests.pytest_ipa.integration.host.Host.master.cmd31] RUN ['ipa', 'dnsrecord-add', 'ipa.test', 'client1.ipa.test.', '--a-rec', '192.168.122.221'] [ipatests.pytest_ipa.integration.host.Host.master.cmd31] Record name: client1 [ipatests.pytest_ipa.integration.host.Host.master.cmd31] A record: 192.168.122.221 [ipatests.pytest_ipa.integration.host.Host.master.cmd31] Exit code: 0 [ipatests.pytest_ipa.integration.tasks] Installing client <Host master.ipa.test (master)> on <Host client0.ipa.test (client)> [ipatests.pytest_ipa.integration] Adding client0.ipa.test:/var/log/ipaclient-install.log to list of logs to collect [ipatests.pytest_ipa.integration.host.Host.client0.ParamikoTransport] RUN ['true'] [ipatests.pytest_ipa.integration.host.Host.client0.cmd2] RUN ['true'] [ipatests.pytest_ipa.integration.host.Host.client0.cmd2] Exit code: 0 [ipatests.pytest_ipa.integration] Adding client0.ipa.test:/ipatests/env.sh to list of logs to collect [ipatests.pytest_ipa.integration.host.Host.client0.ParamikoTransport] STAT /ipatests [ipatests.pytest_ipa.integration.host.Host.client0.ParamikoTransport] WRITE /ipatests/env.sh [ipatests.pytest_ipa.integration.host.Host.client0.ParamikoTransport] STAT /etc/hostname [ipatests.pytest_ipa.integration.host.Host.client0.ParamikoTransport] STAT /ipatests/file_backup/etc [ipatests.pytest_ipa.integration.host.Host.client0.ParamikoTransport] STAT /ipatests/file_backup [ipatests.pytest_ipa.integration.host.Host.client0.ParamikoTransport] STAT /ipatests [ipatests.pytest_ipa.integration.host.Host.client0.ParamikoTransport] MKDIR /ipatests/file_backup [ipatests.pytest_ipa.integration.host.Host.client0.ParamikoTransport] MKDIR /ipatests/file_backup/etc [ipatests.pytest_ipa.integration.host.Host.client0.ParamikoTransport] RUN ['cp', '-af', '/etc/hostname', '/ipatests/file_backup/etc/hostname'] [ipatests.pytest_ipa.integration.host.Host.client0.cmd3] RUN ['cp', '-af', '/etc/hostname', '/ipatests/file_backup/etc/hostname'] [ipatests.pytest_ipa.integration.host.Host.client0.cmd3] Exit code: 0 [ipatests.pytest_ipa.integration.host.Host.client0.ParamikoTransport] WRITE /etc/hostname [ipatests.pytest_ipa.integration.host.Host.client0.ParamikoTransport] RUN ['hostname', 'client0.ipa.test'] [ipatests.pytest_ipa.integration.host.Host.client0.cmd4] RUN ['hostname', 'client0.ipa.test'] [ipatests.pytest_ipa.integration.host.Host.client0.cmd4] Exit code: 0 [ipatests.pytest_ipa.integration.host.Host.client0.ParamikoTransport] RUN hostname > '/ipatests/backup_hostname' [ipatests.pytest_ipa.integration.host.Host.client0.cmd5] RUN hostname > '/ipatests/backup_hostname' [ipatests.pytest_ipa.integration.host.Host.client0.cmd5] Exit code: 0 [ipatests.pytest_ipa.integration.host.Host.client0.ParamikoTransport] RUN ['ss', '--all', '--tcp', '--udp', '--numeric', '--processes'] [ipatests.pytest_ipa.integration.host.Host.client0.cmd6] RUN ['ss', '--all', '--tcp', '--udp', '--numeric', '--processes'] [ipatests.pytest_ipa.integration.host.Host.client0.cmd6] Netid State Recv-Q Send-Q Local Address:Port Peer Address:Port Process [ipatests.pytest_ipa.integration.host.Host.client0.cmd6] udp UNCONN 0 0 192.168.122.135%eth0:68 0.0.0.0:* users:(("NetworkManager",pid=1966,fd=20)) [ipatests.pytest_ipa.integration.host.Host.client0.cmd6] udp UNCONN 0 0 127.0.0.1:323 0.0.0.0:* users:(("chronyd",pid=497,fd=6)) [ipatests.pytest_ipa.integration.host.Host.client0.cmd6] udp UNCONN 0 0 [::1]:323 [::]:* users:(("chronyd",pid=497,fd=7)) [ipatests.pytest_ipa.integration.host.Host.client0.cmd6] tcp LISTEN 0 128 0.0.0.0:22 0.0.0.0:* users:(("sshd",pid=568,fd=5)) [ipatests.pytest_ipa.integration.host.Host.client0.cmd6] tcp ESTAB 0 0 192.168.122.135:22 192.168.122.69:58298 users:(("sshd",pid=18211,fd=5),("sshd",pid=18208,fd=5)) [ipatests.pytest_ipa.integration.host.Host.client0.cmd6] tcp ESTAB 0 0 192.168.122.135:22 192.168.122.1:42690 users:(("sshd",pid=2682,fd=5),("sshd",pid=2660,fd=5)) [ipatests.pytest_ipa.integration.host.Host.client0.cmd6] tcp LISTEN 0 128 [::]:22 [::]:* users:(("sshd",pid=568,fd=7)) [ipatests.pytest_ipa.integration.host.Host.client0.cmd6] Exit code: 0 [ipatests.pytest_ipa.integration.host.Host.client0.ParamikoTransport] RUN ['ss', '--all', '--tcp', '--udp', '--numeric', '--processes', '-o', 'state', 'all', '( sport = :749 or dport = :749 or sport = :464 or dport = :464 )'] [ipatests.pytest_ipa.integration.host.Host.client0.cmd7] RUN ['ss', '--all', '--tcp', '--udp', '--numeric', '--processes', '-o', 'state', 'all', '( sport = :749 or dport = :749 or sport = :464 or dport = :464 )'] [ipatests.pytest_ipa.integration.host.Host.client0.cmd7] Netid State Recv-Q Send-Q Local Address:Port Peer Address:Port Process [ipatests.pytest_ipa.integration.host.Host.client0.cmd7] Exit code: 0 [ipatests.pytest_ipa.integration.host.Host.master.ParamikoTransport] RUN ['kinit', 'admin'] [ipatests.pytest_ipa.integration.host.Host.master.cmd32] RUN ['kinit', 'admin'] [ipatests.pytest_ipa.integration.host.Host.master.cmd32] Password for admin@IPA.TEST: [ipatests.pytest_ipa.integration.host.Host.master.cmd32] Exit code: 0 [ipatests.pytest_ipa.integration.host.Host.master.ParamikoTransport] RUN ['ipa', 'dnsconfig-mod', '--allow-sync-ptr=true'] [ipatests.pytest_ipa.integration.host.Host.master.cmd33] RUN ['ipa', 'dnsconfig-mod', '--allow-sync-ptr=true'] [ipatests.pytest_ipa.integration.host.Host.master.cmd33] Allow PTR sync: TRUE [ipatests.pytest_ipa.integration.host.Host.master.cmd33] IPA DNS servers: master.ipa.test [ipatests.pytest_ipa.integration.host.Host.master.cmd33] Exit code: 0 [ipatests.pytest_ipa.integration.host.Host.master.ParamikoTransport] RUN ['ipa', 'dnszone-add', '122.168.192.in-addr.arpa.'] [ipatests.pytest_ipa.integration.host.Host.master.cmd34] RUN ['ipa', 'dnszone-add', '122.168.192.in-addr.arpa.'] [ipatests.pytest_ipa.integration.host.Host.master.cmd34] ipa: ERROR: DNS zone with name "122.168.192.in-addr.arpa." already exists [ipatests.pytest_ipa.integration.host.Host.master.cmd34] Exit code: 1 ipa: WARNING: ipa: ERROR: DNS zone with name "122.168.192.in-addr.arpa." already exists [ipatests.pytest_ipa.integration] Adding client1.ipa.test:/var/log/ipaclient-install.log to list of logs to collect [ipatests.pytest_ipa.integration.host.Host.client1.ParamikoTransport] RUN ['true'] [ipatests.pytest_ipa.integration.host.Host.client1.cmd2] RUN ['true'] [ipatests.pytest_ipa.integration.host.Host.client1.cmd2] Exit code: 0 [ipatests.pytest_ipa.integration] Adding client1.ipa.test:/ipatests/env.sh to list of logs to collect [ipatests.pytest_ipa.integration.host.Host.client1.ParamikoTransport] STAT /ipatests [ipatests.pytest_ipa.integration.host.Host.client1.ParamikoTransport] WRITE /ipatests/env.sh [ipatests.pytest_ipa.integration.host.Host.client1.ParamikoTransport] STAT /etc/hostname [ipatests.pytest_ipa.integration.host.Host.client1.ParamikoTransport] STAT /ipatests/file_backup/etc [ipatests.pytest_ipa.integration.host.Host.client1.ParamikoTransport] STAT /ipatests/file_backup [ipatests.pytest_ipa.integration.host.Host.client1.ParamikoTransport] STAT /ipatests [ipatests.pytest_ipa.integration.host.Host.client1.ParamikoTransport] MKDIR /ipatests/file_backup [ipatests.pytest_ipa.integration.host.Host.client1.ParamikoTransport] MKDIR /ipatests/file_backup/etc [ipatests.pytest_ipa.integration.host.Host.client1.ParamikoTransport] RUN ['cp', '-af', '/etc/hostname', '/ipatests/file_backup/etc/hostname'] [ipatests.pytest_ipa.integration.host.Host.client1.cmd3] RUN ['cp', '-af', '/etc/hostname', '/ipatests/file_backup/etc/hostname'] [ipatests.pytest_ipa.integration.host.Host.client1.cmd3] Exit code: 0 [ipatests.pytest_ipa.integration.host.Host.client1.ParamikoTransport] WRITE /etc/hostname [ipatests.pytest_ipa.integration.host.Host.client1.ParamikoTransport] RUN ['hostname', 'client1.ipa.test'] [ipatests.pytest_ipa.integration.host.Host.client1.cmd4] RUN ['hostname', 'client1.ipa.test'] [ipatests.pytest_ipa.integration.host.Host.client1.cmd4] Exit code: 0 [ipatests.pytest_ipa.integration.host.Host.client1.ParamikoTransport] RUN hostname > '/ipatests/backup_hostname' [ipatests.pytest_ipa.integration.host.Host.client1.cmd5] RUN hostname > '/ipatests/backup_hostname' [ipatests.pytest_ipa.integration.host.Host.client1.cmd5] Exit code: 0 [ipatests.pytest_ipa.integration.host.Host.client1.ParamikoTransport] RUN ['ss', '--all', '--tcp', '--udp', '--numeric', '--processes'] [ipatests.pytest_ipa.integration.host.Host.client1.cmd6] RUN ['ss', '--all', '--tcp', '--udp', '--numeric', '--processes'] [ipatests.pytest_ipa.integration.host.Host.client1.cmd6] Netid State Recv-Q Send-Q Local Address:Port Peer Address:Port Process [ipatests.pytest_ipa.integration.host.Host.client1.cmd6] udp UNCONN 0 0 127.0.0.1:323 0.0.0.0:* users:(("chronyd",pid=498,fd=6)) [ipatests.pytest_ipa.integration.host.Host.client1.cmd6] udp UNCONN 0 0 192.168.122.221%eth0:68 0.0.0.0:* users:(("NetworkManager",pid=1966,fd=20)) [ipatests.pytest_ipa.integration.host.Host.client1.cmd6] udp UNCONN 0 0 [::1]:323 [::]:* users:(("chronyd",pid=498,fd=7)) [ipatests.pytest_ipa.integration.host.Host.client1.cmd6] tcp LISTEN 0 128 0.0.0.0:22 0.0.0.0:* users:(("sshd",pid=552,fd=4)) [ipatests.pytest_ipa.integration.host.Host.client1.cmd6] tcp ESTAB 0 0 192.168.122.221:22 192.168.122.69:57074 users:(("sshd",pid=18430,fd=5),("sshd",pid=18427,fd=5)) [ipatests.pytest_ipa.integration.host.Host.client1.cmd6] tcp ESTAB 0 0 192.168.122.221:22 192.168.122.1:33662 users:(("sshd",pid=2674,fd=5),("sshd",pid=2655,fd=5)) [ipatests.pytest_ipa.integration.host.Host.client1.cmd6] tcp LISTEN 0 128 [::]:22 [::]:* users:(("sshd",pid=552,fd=6)) [ipatests.pytest_ipa.integration.host.Host.client1.cmd6] Exit code: 0 [ipatests.pytest_ipa.integration.host.Host.client1.ParamikoTransport] RUN ['ss', '--all', '--tcp', '--udp', '--numeric', '--processes', '-o', 'state', 'all', '( sport = :749 or dport = :749 or sport = :464 or dport = :464 )'] [ipatests.pytest_ipa.integration.host.Host.client1.cmd7] RUN ['ss', '--all', '--tcp', '--udp', '--numeric', '--processes', '-o', 'state', 'all', '( sport = :749 or dport = :749 or sport = :464 or dport = :464 )'] [ipatests.pytest_ipa.integration.host.Host.client1.cmd7] Netid State Recv-Q Send-Q Local Address:Port Peer Address:Port Process [ipatests.pytest_ipa.integration.host.Host.client1.cmd7] Exit code: 0 [ipatests.pytest_ipa.integration.host.Host.master.ParamikoTransport] RUN ['kinit', 'admin'] [ipatests.pytest_ipa.integration.host.Host.master.cmd35] RUN ['kinit', 'admin'] [ipatests.pytest_ipa.integration.host.Host.master.cmd35] Password for admin@IPA.TEST: [ipatests.pytest_ipa.integration.host.Host.master.cmd35] Exit code: 0 [ipatests.pytest_ipa.integration.host.Host.master.ParamikoTransport] RUN ['ipa', 'dnsconfig-mod', '--allow-sync-ptr=true'] [ipatests.pytest_ipa.integration.host.Host.master.cmd36] RUN ['ipa', 'dnsconfig-mod', '--allow-sync-ptr=true'] [ipatests.pytest_ipa.integration.host.Host.master.cmd36] ipa: ERROR: no modifications to be performed [ipatests.pytest_ipa.integration.host.Host.master.cmd36] Exit code: 1 [ipatests.pytest_ipa.integration.host.Host.master.ParamikoTransport] RUN ['ipa', 'dnszone-add', '122.168.192.in-addr.arpa.'] [ipatests.pytest_ipa.integration.host.Host.master.cmd37] RUN ['ipa', 'dnszone-add', '122.168.192.in-addr.arpa.'] [ipatests.pytest_ipa.integration.host.Host.master.cmd37] ipa: ERROR: DNS zone with name "122.168.192.in-addr.arpa." already exists [ipatests.pytest_ipa.integration.host.Host.master.cmd37] Exit code: 1 ipa: WARNING: ipa: ERROR: DNS zone with name "122.168.192.in-addr.arpa." already exists
-------------------------------Captured log setup-------------------------------
INFO ipatests.pytest_ipa.integration:__init__.py:267 Preparing host client0.ipa.test INFO paramiko.transport:transport.py:1819 Connected (version 2.0, client OpenSSH_8.1) DEBUG ipatests.pytest_ipa.integration.host.Host.client0.ParamikoTransport:transport.py:247 Authenticating with private RSA key using user root INFO paramiko.transport:transport.py:1819 Authentication (publickey) successful! INFO ipatests.pytest_ipa.integration.host.Host.client0.ParamikoTransport:transport.py:318 RUN ['true'] DEBUG ipatests.pytest_ipa.integration.host.Host.client0.cmd1:transport.py:513 RUN ['true'] DEBUG ipatests.pytest_ipa.integration.host.Host.client0.cmd1:transport.py:558 -bash: line 1: cd: /ipatests: No such file or directory DEBUG ipatests.pytest_ipa.integration.host.Host.client0.cmd1:transport.py:217 Exit code: 0 INFO ipatests.pytest_ipa.integration:__init__.py:261 Adding client0.ipa.test:/ipatests/env.sh to list of logs to collect DEBUG ipatests.pytest_ipa.integration.host.Host.client0.ParamikoTransport:transport.py:301 STAT /ipatests INFO paramiko.transport.sftp:sftp.py:158 [chan 1] Opened sftp connection (server version 3) DEBUG ipatests.pytest_ipa.integration.host.Host.client0.ParamikoTransport:transport.py:301 STAT / INFO ipatests.pytest_ipa.integration.host.Host.client0.ParamikoTransport:transport.py:312 MKDIR /ipatests INFO ipatests.pytest_ipa.integration.host.Host.client0.ParamikoTransport:transport.py:293 WRITE /ipatests/env.sh INFO ipatests.pytest_ipa.integration:__init__.py:267 Preparing host master.ipa.test INFO paramiko.transport:transport.py:1819 Connected (version 2.0, client OpenSSH_8.1) DEBUG ipatests.pytest_ipa.integration.host.Host.master.ParamikoTransport:transport.py:247 Authenticating with private RSA key using user root INFO paramiko.transport:transport.py:1819 Authentication (publickey) successful! INFO ipatests.pytest_ipa.integration.host.Host.master.ParamikoTransport:transport.py:318 RUN ['true'] DEBUG ipatests.pytest_ipa.integration.host.Host.master.cmd1:transport.py:513 RUN ['true'] DEBUG ipatests.pytest_ipa.integration.host.Host.master.cmd1:transport.py:558 -bash: line 1: cd: /ipatests: No such file or directory DEBUG ipatests.pytest_ipa.integration.host.Host.master.cmd1:transport.py:217 Exit code: 0 INFO ipatests.pytest_ipa.integration:__init__.py:261 Adding master.ipa.test:/ipatests/env.sh to list of logs to collect DEBUG ipatests.pytest_ipa.integration.host.Host.master.ParamikoTransport:transport.py:301 STAT /ipatests INFO paramiko.transport.sftp:sftp.py:158 [chan 1] Opened sftp connection (server version 3) DEBUG ipatests.pytest_ipa.integration.host.Host.master.ParamikoTransport:transport.py:301 STAT / INFO ipatests.pytest_ipa.integration.host.Host.master.ParamikoTransport:transport.py:312 MKDIR /ipatests INFO ipatests.pytest_ipa.integration.host.Host.master.ParamikoTransport:transport.py:293 WRITE /ipatests/env.sh INFO ipatests.pytest_ipa.integration:__init__.py:267 Preparing host client1.ipa.test INFO paramiko.transport:transport.py:1819 Connected (version 2.0, client OpenSSH_8.1) DEBUG ipatests.pytest_ipa.integration.host.Host.client1.ParamikoTransport:transport.py:247 Authenticating with private RSA key using user root INFO paramiko.transport:transport.py:1819 Authentication (publickey) successful! INFO ipatests.pytest_ipa.integration.host.Host.client1.ParamikoTransport:transport.py:318 RUN ['true'] DEBUG ipatests.pytest_ipa.integration.host.Host.client1.cmd1:transport.py:513 RUN ['true'] DEBUG ipatests.pytest_ipa.integration.host.Host.client1.cmd1:transport.py:558 -bash: line 1: cd: /ipatests: No such file or directory DEBUG ipatests.pytest_ipa.integration.host.Host.client1.cmd1:transport.py:217 Exit code: 0 INFO ipatests.pytest_ipa.integration:__init__.py:261 Adding client1.ipa.test:/ipatests/env.sh to list of logs to collect DEBUG ipatests.pytest_ipa.integration.host.Host.client1.ParamikoTransport:transport.py:301 STAT /ipatests INFO paramiko.transport.sftp:sftp.py:158 [chan 1] Opened sftp connection (server version 3) DEBUG ipatests.pytest_ipa.integration.host.Host.client1.ParamikoTransport:transport.py:301 STAT / INFO ipatests.pytest_ipa.integration.host.Host.client1.ParamikoTransport:transport.py:312 MKDIR /ipatests INFO ipatests.pytest_ipa.integration.host.Host.client1.ParamikoTransport:transport.py:293 WRITE /ipatests/env.sh INFO ipatests.pytest_ipa.integration:__init__.py:267 Preparing host ad-root.ad.test INFO ipatests.pytest_ipa.integration:__init__.py:261 Adding master.ipa.test:/var/log/dirsrv/slapd-IPA-TEST/errors to list of logs to collect INFO ipatests.pytest_ipa.integration:__init__.py:261 Adding master.ipa.test:/var/log/dirsrv/slapd-IPA-TEST/access to list of logs to collect INFO ipatests.pytest_ipa.integration:__init__.py:261 Adding master.ipa.test:/var/log/dirsrv/slapd-IPA-TEST/audit to list of logs to collect INFO ipatests.pytest_ipa.integration:__init__.py:261 Adding master.ipa.test:/var/log/ipaserver-install.log to list of logs to collect INFO ipatests.pytest_ipa.integration:__init__.py:261 Adding master.ipa.test:/var/log/ipaserver-uninstall.log to list of logs to collect INFO ipatests.pytest_ipa.integration:__init__.py:261 Adding master.ipa.test:/var/log/ipaclient-install.log to list of logs to collect INFO ipatests.pytest_ipa.integration:__init__.py:261 Adding master.ipa.test:/var/log/ipaclient-uninstall.log to list of logs to collect INFO ipatests.pytest_ipa.integration:__init__.py:261 Adding master.ipa.test:/var/log/ipareplica-install.log to list of logs to collect INFO ipatests.pytest_ipa.integration:__init__.py:261 Adding master.ipa.test:/var/log/ipareplica-conncheck.log to list of logs to collect INFO ipatests.pytest_ipa.integration:__init__.py:261 Adding master.ipa.test:/var/log/ipareplica-ca-install.log to list of logs to collect INFO ipatests.pytest_ipa.integration:__init__.py:261 Adding master.ipa.test:/var/log/ipaserver-kra-install.log to list of logs to collect INFO ipatests.pytest_ipa.integration:__init__.py:261 Adding master.ipa.test:/var/log/ipa-custodia.audit.log to list of logs to collect INFO ipatests.pytest_ipa.integration:__init__.py:261 Adding master.ipa.test:/var/log/ipaclient-uninstall.log to list of logs to collect INFO ipatests.pytest_ipa.integration:__init__.py:261 Adding master.ipa.test:/var/log/iparestore.log to list of logs to collect INFO ipatests.pytest_ipa.integration:__init__.py:261 Adding master.ipa.test:/var/log/ipabackup.log to list of logs to collect INFO ipatests.pytest_ipa.integration:__init__.py:261 Adding master.ipa.test:/var/log/kadmind.log to list of logs to collect INFO ipatests.pytest_ipa.integration:__init__.py:261 Adding master.ipa.test:/var/log/krb5kdc.log to list of logs to collect INFO ipatests.pytest_ipa.integration:__init__.py:261 Adding master.ipa.test:/var/log/httpd/error_log to list of logs to collect INFO ipatests.pytest_ipa.integration:__init__.py:261 Adding master.ipa.test:/var/log/pki/ to list of logs to collect INFO ipatests.pytest_ipa.integration:__init__.py:261 Adding master.ipa.test:/var/log/audit/audit.log to list of logs to collect INFO ipatests.pytest_ipa.integration.host.Host.master.ParamikoTransport:transport.py:318 RUN ['true'] DEBUG ipatests.pytest_ipa.integration.host.Host.master.cmd2:transport.py:513 RUN ['true'] DEBUG ipatests.pytest_ipa.integration.host.Host.master.cmd2:transport.py:217 Exit code: 0 INFO ipatests.pytest_ipa.integration:__init__.py:261 Adding master.ipa.test:/ipatests/env.sh to list of logs to collect DEBUG ipatests.pytest_ipa.integration.host.Host.master.ParamikoTransport:transport.py:301 STAT /ipatests INFO ipatests.pytest_ipa.integration.host.Host.master.ParamikoTransport:transport.py:293 WRITE /ipatests/env.sh DEBUG ipatests.pytest_ipa.integration.host.Host.master.ParamikoTransport:transport.py:301 STAT /etc/hostname DEBUG ipatests.pytest_ipa.integration.host.Host.master.ParamikoTransport:transport.py:301 STAT /ipatests/file_backup/etc DEBUG ipatests.pytest_ipa.integration.host.Host.master.ParamikoTransport:transport.py:301 STAT /ipatests/file_backup DEBUG ipatests.pytest_ipa.integration.host.Host.master.ParamikoTransport:transport.py:301 STAT /ipatests INFO ipatests.pytest_ipa.integration.host.Host.master.ParamikoTransport:transport.py:312 MKDIR /ipatests/file_backup INFO ipatests.pytest_ipa.integration.host.Host.master.ParamikoTransport:transport.py:312 MKDIR /ipatests/file_backup/etc INFO ipatests.pytest_ipa.integration.host.Host.master.ParamikoTransport:transport.py:318 RUN ['cp', '-af', '/etc/hostname', '/ipatests/file_backup/etc/hostname'] DEBUG ipatests.pytest_ipa.integration.host.Host.master.cmd3:transport.py:513 RUN ['cp', '-af', '/etc/hostname', '/ipatests/file_backup/etc/hostname'] DEBUG ipatests.pytest_ipa.integration.host.Host.master.cmd3:transport.py:217 Exit code: 0 INFO ipatests.pytest_ipa.integration.host.Host.master.ParamikoTransport:transport.py:293 WRITE /etc/hostname INFO ipatests.pytest_ipa.integration.host.Host.master.ParamikoTransport:transport.py:318 RUN ['hostname', 'master.ipa.test'] DEBUG ipatests.pytest_ipa.integration.host.Host.master.cmd4:transport.py:513 RUN ['hostname', 'master.ipa.test'] DEBUG ipatests.pytest_ipa.integration.host.Host.master.cmd4:transport.py:217 Exit code: 0 INFO ipatests.pytest_ipa.integration.host.Host.master.ParamikoTransport:transport.py:318 RUN hostname > '/ipatests/backup_hostname' DEBUG ipatests.pytest_ipa.integration.host.Host.master.cmd5:transport.py:513 RUN hostname > '/ipatests/backup_hostname' DEBUG ipatests.pytest_ipa.integration.host.Host.master.cmd5:transport.py:217 Exit code: 0 INFO ipatests.pytest_ipa.integration.host.Host.master.ParamikoTransport:transport.py:318 RUN ['ss', '--all', '--tcp', '--udp', '--numeric', '--processes'] DEBUG ipatests.pytest_ipa.integration.host.Host.master.cmd6:transport.py:513 RUN ['ss', '--all', '--tcp', '--udp', '--numeric', '--processes'] DEBUG ipatests.pytest_ipa.integration.host.Host.master.cmd6:transport.py:558 Netid State Recv-Q Send-Q Local Address:Port Peer Address:Port Process DEBUG ipatests.pytest_ipa.integration.host.Host.master.cmd6:transport.py:558 udp UNCONN 0 0 192.168.122.15%eth0:68 0.0.0.0:* users:(("NetworkManager",pid=1979,fd=20)) DEBUG ipatests.pytest_ipa.integration.host.Host.master.cmd6:transport.py:558 udp UNCONN 0 0 127.0.0.1:323 0.0.0.0:* users:(("chronyd",pid=509,fd=6)) DEBUG ipatests.pytest_ipa.integration.host.Host.master.cmd6:transport.py:558 udp UNCONN 0 0 [::1]:323 [::]:* users:(("chronyd",pid=509,fd=7)) DEBUG ipatests.pytest_ipa.integration.host.Host.master.cmd6:transport.py:558 tcp LISTEN 0 128 0.0.0.0:22 0.0.0.0:* users:(("sshd",pid=557,fd=4)) DEBUG ipatests.pytest_ipa.integration.host.Host.master.cmd6:transport.py:558 tcp TIME-WAIT 0 0 192.168.122.15:36136 52.219.74.154:80 DEBUG ipatests.pytest_ipa.integration.host.Host.master.cmd6:transport.py:558 tcp TIME-WAIT 0 0 192.168.122.15:36150 52.219.74.154:80 DEBUG ipatests.pytest_ipa.integration.host.Host.master.cmd6:transport.py:558 tcp ESTAB 0 0 192.168.122.15:22 192.168.122.1:60116 users:(("sshd",pid=2920,fd=5),("sshd",pid=2917,fd=5)) DEBUG ipatests.pytest_ipa.integration.host.Host.master.cmd6:transport.py:558 tcp TIME-WAIT 0 0 192.168.122.15:36138 52.219.74.154:80 DEBUG ipatests.pytest_ipa.integration.host.Host.master.cmd6:transport.py:558 tcp TIME-WAIT 0 0 192.168.122.15:36134 52.219.74.154:80 DEBUG ipatests.pytest_ipa.integration.host.Host.master.cmd6:transport.py:558 tcp TIME-WAIT 0 0 192.168.122.15:33622 128.112.136.119:80 DEBUG ipatests.pytest_ipa.integration.host.Host.master.cmd6:transport.py:558 tcp TIME-WAIT 0 0 192.168.122.15:36144 52.219.74.154:80 DEBUG ipatests.pytest_ipa.integration.host.Host.master.cmd6:transport.py:558 tcp TIME-WAIT 0 0 192.168.122.15:36152 52.219.74.154:80 DEBUG ipatests.pytest_ipa.integration.host.Host.master.cmd6:transport.py:558 tcp ESTAB 0 0 192.168.122.15:22 192.168.122.1:59828 users:(("sshd",pid=2702,fd=5),("sshd",pid=2669,fd=5)) DEBUG ipatests.pytest_ipa.integration.host.Host.master.cmd6:transport.py:558 tcp ESTAB 0 0 192.168.122.15:22 192.168.122.69:38716 users:(("sshd",pid=18446,fd=5),("sshd",pid=18443,fd=5)) DEBUG ipatests.pytest_ipa.integration.host.Host.master.cmd6:transport.py:558 tcp LISTEN 0 128 [::]:22 [::]:* users:(("sshd",pid=557,fd=6)) DEBUG ipatests.pytest_ipa.integration.host.Host.master.cmd6:transport.py:217 Exit code: 0 INFO ipatests.pytest_ipa.integration.host.Host.master.ParamikoTransport:transport.py:318 RUN ['ss', '--all', '--tcp', '--udp', '--numeric', '--processes', '-o', 'state', 'all', '( sport = :749 or dport = :749 or sport = :464 or dport = :464 )'] DEBUG ipatests.pytest_ipa.integration.host.Host.master.cmd7:transport.py:513 RUN ['ss', '--all', '--tcp', '--udp', '--numeric', '--processes', '-o', 'state', 'all', '( sport = :749 or dport = :749 or sport = :464 or dport = :464 )'] DEBUG ipatests.pytest_ipa.integration.host.Host.master.cmd7:transport.py:558 Netid State Recv-Q Send-Q Local Address:Port Peer Address:Port Process DEBUG ipatests.pytest_ipa.integration.host.Host.master.cmd7:transport.py:217 Exit code: 0 DEBUG ipatests.pytest_ipa.integration.host.Host.master.ParamikoTransport:transport.py:301 STAT /bin/systemctl INFO ipatests.pytest_ipa.integration.host.Host.master.ParamikoTransport:transport.py:318 RUN ['systemctl', 'stop', 'httpd'] DEBUG ipatests.pytest_ipa.integration.host.Host.master.cmd8:transport.py:513 RUN ['systemctl', 'stop', 'httpd'] DEBUG ipatests.pytest_ipa.integration.host.Host.master.cmd8:transport.py:217 Exit code: 0 INFO ipatests.pytest_ipa.integration.host.Host.master.ParamikoTransport:transport.py:318 RUN for line in `ipcs -s | grep apache | cut -d " " -f 2`; do ipcrm -s $line; done DEBUG ipatests.pytest_ipa.integration.host.Host.master.cmd9:transport.py:513 RUN for line in `ipcs -s | grep apache | cut -d " " -f 2`; do ipcrm -s $line; done DEBUG ipatests.pytest_ipa.integration.host.Host.master.cmd9:transport.py:217 Exit code: 0 INFO ipatests.pytest_ipa.integration.host.Host.master.ParamikoTransport:transport.py:318 RUN ['systemctl', 'unmask', 'firewalld'] DEBUG ipatests.pytest_ipa.integration.host.Host.master.cmd10:transport.py:513 RUN ['systemctl', 'unmask', 'firewalld'] DEBUG ipatests.pytest_ipa.integration.host.Host.master.cmd10:transport.py:558 Removed /etc/systemd/system/firewalld.service. DEBUG ipatests.pytest_ipa.integration.host.Host.master.cmd10:transport.py:217 Exit code: 0 INFO ipatests.pytest_ipa.integration.host.Host.master.ParamikoTransport:transport.py:318 RUN ['systemctl', 'enable', 'firewalld'] DEBUG ipatests.pytest_ipa.integration.host.Host.master.cmd11:transport.py:513 RUN ['systemctl', 'enable', 'firewalld'] DEBUG ipatests.pytest_ipa.integration.host.Host.master.cmd11:transport.py:217 Exit code: 0 INFO ipatests.pytest_ipa.integration.host.Host.master.ParamikoTransport:transport.py:318 RUN ['systemctl', 'start', 'firewalld'] DEBUG ipatests.pytest_ipa.integration.host.Host.master.cmd12:transport.py:513 RUN ['systemctl', 'start', 'firewalld'] DEBUG ipatests.pytest_ipa.integration.host.Host.master.cmd12:transport.py:217 Exit code: 0 INFO ipatests.pytest_ipa.integration.host.Host.master.ParamikoTransport:transport.py:318 RUN ['ipa-server-install', '-n', 'ipa.test', '-r', 'IPA.TEST', '-p', 'Secret.123', '-a', 'Secret.123', '--domain-level=1', '-U', '--setup-dns', '--forwarder', '192.168.122.1', '--auto-reverse'] DEBUG ipatests.pytest_ipa.integration.host.Host.master.cmd13:transport.py:513 RUN ['ipa-server-install', '-n', 'ipa.test', '-r', 'IPA.TEST', '-p', 'Secret.123', '-a', 'Secret.123', '--domain-level=1', '-U', '--setup-dns', '--forwarder', '192.168.122.1', '--auto-reverse'] DEBUG ipatests.pytest_ipa.integration.host.Host.master.cmd13:transport.py:558 Checking DNS domain ipa.test., please wait ... DEBUG ipatests.pytest_ipa.integration.host.Host.master.cmd13:transport.py:558 Checking DNS domain 122.168.192.in-addr.arpa., please wait ... DEBUG ipatests.pytest_ipa.integration.host.Host.master.cmd13:transport.py:558 Reverse zone 122.168.192.in-addr.arpa. will be created DEBUG ipatests.pytest_ipa.integration.host.Host.master.cmd13:transport.py:558 Synchronizing time DEBUG ipatests.pytest_ipa.integration.host.Host.master.cmd13:transport.py:558 No SRV records of NTP servers found and no NTP server or pool address was provided. DEBUG ipatests.pytest_ipa.integration.host.Host.master.cmd13:transport.py:558 Attempting to sync time with chronyc. DEBUG ipatests.pytest_ipa.integration.host.Host.master.cmd13:transport.py:558 Process chronyc waitsync failed to sync time! DEBUG ipatests.pytest_ipa.integration.host.Host.master.cmd13:transport.py:558 Unable to sync time with chrony server, assuming the time is in sync. Please check that 123 UDP port is opened, and any time server is on network. DEBUG ipatests.pytest_ipa.integration.host.Host.master.cmd13:transport.py:558 DEBUG ipatests.pytest_ipa.integration.host.Host.master.cmd13:transport.py:558 The log file for this installation can be found in /var/log/ipaserver-install.log DEBUG ipatests.pytest_ipa.integration.host.Host.master.cmd13:transport.py:558 ============================================================================== DEBUG ipatests.pytest_ipa.integration.host.Host.master.cmd13:transport.py:558 This program will set up the FreeIPA Server. DEBUG ipatests.pytest_ipa.integration.host.Host.master.cmd13:transport.py:558 Version 4.9.0.dev DEBUG ipatests.pytest_ipa.integration.host.Host.master.cmd13:transport.py:558 DEBUG ipatests.pytest_ipa.integration.host.Host.master.cmd13:transport.py:558 This includes: DEBUG ipatests.pytest_ipa.integration.host.Host.master.cmd13:transport.py:558 * Configure a stand-alone CA (dogtag) for certificate management DEBUG ipatests.pytest_ipa.integration.host.Host.master.cmd13:transport.py:558 * Configure the NTP client (chronyd) DEBUG ipatests.pytest_ipa.integration.host.Host.master.cmd13:transport.py:558 * Create and configure an instance of Directory Server DEBUG ipatests.pytest_ipa.integration.host.Host.master.cmd13:transport.py:558 * Create and configure a Kerberos Key Distribution Center (KDC) DEBUG ipatests.pytest_ipa.integration.host.Host.master.cmd13:transport.py:558 * Configure Apache (httpd) DEBUG ipatests.pytest_ipa.integration.host.Host.master.cmd13:transport.py:558 * Configure DNS (bind) DEBUG ipatests.pytest_ipa.integration.host.Host.master.cmd13:transport.py:558 * Configure the KDC to enable PKINIT DEBUG ipatests.pytest_ipa.integration.host.Host.master.cmd13:transport.py:558 DEBUG ipatests.pytest_ipa.integration.host.Host.master.cmd13:transport.py:558 Warning: skipping DNS resolution of host master.ipa.test DEBUG ipatests.pytest_ipa.integration.host.Host.master.cmd13:transport.py:558 Checking DNS forwarders, please wait ... DEBUG ipatests.pytest_ipa.integration.host.Host.master.cmd13:transport.py:558 Using reverse zone(s) 122.168.192.in-addr.arpa. DEBUG ipatests.pytest_ipa.integration.host.Host.master.cmd13:transport.py:558 DEBUG ipatests.pytest_ipa.integration.host.Host.master.cmd13:transport.py:558 The IPA Master Server will be configured with: DEBUG ipatests.pytest_ipa.integration.host.Host.master.cmd13:transport.py:558 Hostname: master.ipa.test DEBUG ipatests.pytest_ipa.integration.host.Host.master.cmd13:transport.py:558 IP address(es): 192.168.122.15 DEBUG ipatests.pytest_ipa.integration.host.Host.master.cmd13:transport.py:558 Domain name: ipa.test DEBUG ipatests.pytest_ipa.integration.host.Host.master.cmd13:transport.py:558 Realm name: IPA.TEST DEBUG ipatests.pytest_ipa.integration.host.Host.master.cmd13:transport.py:558 DEBUG ipatests.pytest_ipa.integration.host.Host.master.cmd13:transport.py:558 The CA will be configured with: DEBUG ipatests.pytest_ipa.integration.host.Host.master.cmd13:transport.py:558 Subject DN: CN=Certificate Authority,O=IPA.TEST DEBUG ipatests.pytest_ipa.integration.host.Host.master.cmd13:transport.py:558 Subject base: O=IPA.TEST DEBUG ipatests.pytest_ipa.integration.host.Host.master.cmd13:transport.py:558 Chaining: self-signed DEBUG ipatests.pytest_ipa.integration.host.Host.master.cmd13:transport.py:558 DEBUG ipatests.pytest_ipa.integration.host.Host.master.cmd13:transport.py:558 BIND DNS server will be configured to serve IPA domain with: DEBUG ipatests.pytest_ipa.integration.host.Host.master.cmd13:transport.py:558 Forwarders: 192.168.122.1 DEBUG ipatests.pytest_ipa.integration.host.Host.master.cmd13:transport.py:558 Forward policy: only DEBUG ipatests.pytest_ipa.integration.host.Host.master.cmd13:transport.py:558 Reverse zone(s): 122.168.192.in-addr.arpa. DEBUG ipatests.pytest_ipa.integration.host.Host.master.cmd13:transport.py:558 DEBUG ipatests.pytest_ipa.integration.host.Host.master.cmd13:transport.py:558 Disabled p11-kit-proxy DEBUG ipatests.pytest_ipa.integration.host.Host.master.cmd13:transport.py:558 Using default chrony configuration. DEBUG ipatests.pytest_ipa.integration.host.Host.master.cmd13:transport.py:558 Warning: IPA was unable to sync time with chrony! DEBUG ipatests.pytest_ipa.integration.host.Host.master.cmd13:transport.py:558 Time synchronization is required for IPA to work correctly DEBUG ipatests.pytest_ipa.integration.host.Host.master.cmd13:transport.py:558 Configuring directory server (dirsrv). Estimated time: 30 seconds DEBUG ipatests.pytest_ipa.integration.host.Host.master.cmd13:transport.py:558 [1/44]: creating directory server instance DEBUG ipatests.pytest_ipa.integration.host.Host.master.cmd13:transport.py:558 [2/44]: configure autobind for root DEBUG ipatests.pytest_ipa.integration.host.Host.master.cmd13:transport.py:558 [3/44]: stopping directory server DEBUG ipatests.pytest_ipa.integration.host.Host.master.cmd13:transport.py:558 [4/44]: updating configuration in dse.ldif DEBUG ipatests.pytest_ipa.integration.host.Host.master.cmd13:transport.py:558 [5/44]: starting directory server DEBUG ipatests.pytest_ipa.integration.host.Host.master.cmd13:transport.py:558 [6/44]: adding default schema DEBUG ipatests.pytest_ipa.integration.host.Host.master.cmd13:transport.py:558 [7/44]: enabling memberof plugin DEBUG ipatests.pytest_ipa.integration.host.Host.master.cmd13:transport.py:558 [8/44]: enabling winsync plugin DEBUG ipatests.pytest_ipa.integration.host.Host.master.cmd13:transport.py:558 [9/44]: configure password logging DEBUG ipatests.pytest_ipa.integration.host.Host.master.cmd13:transport.py:558 [10/44]: configuring replication version plugin DEBUG ipatests.pytest_ipa.integration.host.Host.master.cmd13:transport.py:558 [11/44]: enabling IPA enrollment plugin DEBUG ipatests.pytest_ipa.integration.host.Host.master.cmd13:transport.py:558 [12/44]: configuring uniqueness plugin DEBUG ipatests.pytest_ipa.integration.host.Host.master.cmd13:transport.py:558 [13/44]: configuring uuid plugin DEBUG ipatests.pytest_ipa.integration.host.Host.master.cmd13:transport.py:558 [14/44]: configuring modrdn plugin DEBUG ipatests.pytest_ipa.integration.host.Host.master.cmd13:transport.py:558 [15/44]: configuring DNS plugin DEBUG ipatests.pytest_ipa.integration.host.Host.master.cmd13:transport.py:558 [16/44]: enabling entryUSN plugin DEBUG ipatests.pytest_ipa.integration.host.Host.master.cmd13:transport.py:558 [17/44]: configuring lockout plugin DEBUG ipatests.pytest_ipa.integration.host.Host.master.cmd13:transport.py:558 [18/44]: configuring topology plugin DEBUG ipatests.pytest_ipa.integration.host.Host.master.cmd13:transport.py:558 [19/44]: creating indices DEBUG ipatests.pytest_ipa.integration.host.Host.master.cmd13:transport.py:558 [20/44]: enabling referential integrity plugin DEBUG ipatests.pytest_ipa.integration.host.Host.master.cmd13:transport.py:558 [21/44]: configuring certmap.conf DEBUG ipatests.pytest_ipa.integration.host.Host.master.cmd13:transport.py:558 [22/44]: configure new location for managed entries DEBUG ipatests.pytest_ipa.integration.host.Host.master.cmd13:transport.py:558 [23/44]: configure dirsrv ccache and keytab DEBUG ipatests.pytest_ipa.integration.host.Host.master.cmd13:transport.py:558 [24/44]: enabling SASL mapping fallback DEBUG ipatests.pytest_ipa.integration.host.Host.master.cmd13:transport.py:558 [25/44]: restarting directory server DEBUG ipatests.pytest_ipa.integration.host.Host.master.cmd13:transport.py:558 [26/44]: adding sasl mappings to the directory DEBUG ipatests.pytest_ipa.integration.host.Host.master.cmd13:transport.py:558 [27/44]: adding default layout DEBUG ipatests.pytest_ipa.integration.host.Host.master.cmd13:transport.py:558 [28/44]: adding delegation layout DEBUG ipatests.pytest_ipa.integration.host.Host.master.cmd13:transport.py:558 [29/44]: creating container for managed entries DEBUG ipatests.pytest_ipa.integration.host.Host.master.cmd13:transport.py:558 [30/44]: configuring user private groups DEBUG ipatests.pytest_ipa.integration.host.Host.master.cmd13:transport.py:558 [31/44]: configuring netgroups from hostgroups DEBUG ipatests.pytest_ipa.integration.host.Host.master.cmd13:transport.py:558 [32/44]: creating default Sudo bind user DEBUG ipatests.pytest_ipa.integration.host.Host.master.cmd13:transport.py:558 [33/44]: creating default Auto Member layout DEBUG ipatests.pytest_ipa.integration.host.Host.master.cmd13:transport.py:558 [34/44]: adding range check plugin DEBUG ipatests.pytest_ipa.integration.host.Host.master.cmd13:transport.py:558 [35/44]: creating default HBAC rule allow_all DEBUG ipatests.pytest_ipa.integration.host.Host.master.cmd13:transport.py:558 [36/44]: adding entries for topology management DEBUG ipatests.pytest_ipa.integration.host.Host.master.cmd13:transport.py:558 [37/44]: initializing group membership DEBUG ipatests.pytest_ipa.integration.host.Host.master.cmd13:transport.py:558 [38/44]: adding master entry DEBUG ipatests.pytest_ipa.integration.host.Host.master.cmd13:transport.py:558 [39/44]: initializing domain level DEBUG ipatests.pytest_ipa.integration.host.Host.master.cmd13:transport.py:558 [40/44]: configuring Posix uid/gid generation DEBUG ipatests.pytest_ipa.integration.host.Host.master.cmd13:transport.py:558 [41/44]: adding replication acis DEBUG ipatests.pytest_ipa.integration.host.Host.master.cmd13:transport.py:558 [42/44]: activating sidgen plugin DEBUG ipatests.pytest_ipa.integration.host.Host.master.cmd13:transport.py:558 [43/44]: activating extdom plugin DEBUG ipatests.pytest_ipa.integration.host.Host.master.cmd13:transport.py:558 [44/44]: configuring directory to start on boot DEBUG ipatests.pytest_ipa.integration.host.Host.master.cmd13:transport.py:558 Done configuring directory server (dirsrv). DEBUG ipatests.pytest_ipa.integration.host.Host.master.cmd13:transport.py:558 Configuring Kerberos KDC (krb5kdc) DEBUG ipatests.pytest_ipa.integration.host.Host.master.cmd13:transport.py:558 [1/10]: adding kerberos container to the directory DEBUG ipatests.pytest_ipa.integration.host.Host.master.cmd13:transport.py:558 [2/10]: configuring KDC DEBUG ipatests.pytest_ipa.integration.host.Host.master.cmd13:transport.py:558 [3/10]: initialize kerberos container DEBUG ipatests.pytest_ipa.integration.host.Host.master.cmd13:transport.py:558 [4/10]: adding default ACIs DEBUG ipatests.pytest_ipa.integration.host.Host.master.cmd13:transport.py:558 [5/10]: creating a keytab for the directory DEBUG ipatests.pytest_ipa.integration.host.Host.master.cmd13:transport.py:558 [6/10]: creating a keytab for the machine DEBUG ipatests.pytest_ipa.integration.host.Host.master.cmd13:transport.py:558 [7/10]: adding the password extension to the directory DEBUG ipatests.pytest_ipa.integration.host.Host.master.cmd13:transport.py:558 [8/10]: creating anonymous principal DEBUG ipatests.pytest_ipa.integration.host.Host.master.cmd13:transport.py:558 [9/10]: starting the KDC DEBUG ipatests.pytest_ipa.integration.host.Host.master.cmd13:transport.py:558 [10/10]: configuring KDC to start on boot DEBUG ipatests.pytest_ipa.integration.host.Host.master.cmd13:transport.py:558 Done configuring Kerberos KDC (krb5kdc). DEBUG ipatests.pytest_ipa.integration.host.Host.master.cmd13:transport.py:558 Configuring kadmin DEBUG ipatests.pytest_ipa.integration.host.Host.master.cmd13:transport.py:558 [1/2]: starting kadmin DEBUG ipatests.pytest_ipa.integration.host.Host.master.cmd13:transport.py:558 [2/2]: configuring kadmin to start on boot DEBUG ipatests.pytest_ipa.integration.host.Host.master.cmd13:transport.py:558 Done configuring kadmin. DEBUG ipatests.pytest_ipa.integration.host.Host.master.cmd13:transport.py:558 Configuring ipa-custodia DEBUG ipatests.pytest_ipa.integration.host.Host.master.cmd13:transport.py:558 [1/5]: Making sure custodia container exists DEBUG ipatests.pytest_ipa.integration.host.Host.master.cmd13:transport.py:558 [2/5]: Generating ipa-custodia config file DEBUG ipatests.pytest_ipa.integration.host.Host.master.cmd13:transport.py:558 [3/5]: Generating ipa-custodia keys DEBUG ipatests.pytest_ipa.integration.host.Host.master.cmd13:transport.py:558 [4/5]: starting ipa-custodia DEBUG ipatests.pytest_ipa.integration.host.Host.master.cmd13:transport.py:558 [5/5]: configuring ipa-custodia to start on boot DEBUG ipatests.pytest_ipa.integration.host.Host.master.cmd13:transport.py:558 Done configuring ipa-custodia. DEBUG ipatests.pytest_ipa.integration.host.Host.master.cmd13:transport.py:558 Configuring certificate server (pki-tomcatd). Estimated time: 3 minutes DEBUG ipatests.pytest_ipa.integration.host.Host.master.cmd13:transport.py:558 [1/29]: configuring certificate server instance DEBUG ipatests.pytest_ipa.integration.host.Host.master.cmd13:transport.py:558 [2/29]: Add ipa-pki-wait-running DEBUG ipatests.pytest_ipa.integration.host.Host.master.cmd13:transport.py:558 [3/29]: reindex attributes DEBUG ipatests.pytest_ipa.integration.host.Host.master.cmd13:transport.py:558 [4/29]: exporting Dogtag certificate store pin DEBUG ipatests.pytest_ipa.integration.host.Host.master.cmd13:transport.py:558 [5/29]: stopping certificate server instance to update CS.cfg DEBUG ipatests.pytest_ipa.integration.host.Host.master.cmd13:transport.py:558 [6/29]: backing up CS.cfg DEBUG ipatests.pytest_ipa.integration.host.Host.master.cmd13:transport.py:558 [7/29]: disabling nonces DEBUG ipatests.pytest_ipa.integration.host.Host.master.cmd13:transport.py:558 [8/29]: set up CRL publishing DEBUG ipatests.pytest_ipa.integration.host.Host.master.cmd13:transport.py:558 [9/29]: enable PKIX certificate path discovery and validation DEBUG ipatests.pytest_ipa.integration.host.Host.master.cmd13:transport.py:558 [10/29]: starting certificate server instance DEBUG ipatests.pytest_ipa.integration.host.Host.master.cmd13:transport.py:558 [11/29]: configure certmonger for renewals DEBUG ipatests.pytest_ipa.integration.host.Host.master.cmd13:transport.py:558 [12/29]: requesting RA certificate from CA DEBUG ipatests.pytest_ipa.integration.host.Host.master.cmd13:transport.py:558 [13/29]: setting audit signing renewal to 2 years DEBUG ipatests.pytest_ipa.integration.host.Host.master.cmd13:transport.py:558 [14/29]: restarting certificate server DEBUG ipatests.pytest_ipa.integration.host.Host.master.cmd13:transport.py:558 [15/29]: publishing the CA certificate DEBUG ipatests.pytest_ipa.integration.host.Host.master.cmd13:transport.py:558 [16/29]: adding RA agent as a trusted user DEBUG ipatests.pytest_ipa.integration.host.Host.master.cmd13:transport.py:558 [17/29]: authorizing RA to modify profiles DEBUG ipatests.pytest_ipa.integration.host.Host.master.cmd13:transport.py:558 [18/29]: authorizing RA to manage lightweight CAs DEBUG ipatests.pytest_ipa.integration.host.Host.master.cmd13:transport.py:558 [19/29]: Ensure lightweight CAs container exists DEBUG ipatests.pytest_ipa.integration.host.Host.master.cmd13:transport.py:558 [20/29]: configure certificate renewals DEBUG ipatests.pytest_ipa.integration.host.Host.master.cmd13:transport.py:558 [21/29]: Configure HTTP to proxy connections DEBUG ipatests.pytest_ipa.integration.host.Host.master.cmd13:transport.py:558 [22/29]: restarting certificate server DEBUG ipatests.pytest_ipa.integration.host.Host.master.cmd13:transport.py:558 [23/29]: updating IPA configuration DEBUG ipatests.pytest_ipa.integration.host.Host.master.cmd13:transport.py:558 [24/29]: enabling CA instance DEBUG ipatests.pytest_ipa.integration.host.Host.master.cmd13:transport.py:558 [25/29]: migrating certificate profiles to LDAP DEBUG ipatests.pytest_ipa.integration.host.Host.master.cmd13:transport.py:558 [26/29]: importing IPA certificate profiles DEBUG ipatests.pytest_ipa.integration.host.Host.master.cmd13:transport.py:558 [27/29]: adding default CA ACL DEBUG ipatests.pytest_ipa.integration.host.Host.master.cmd13:transport.py:558 [28/29]: adding 'ipa' CA entry DEBUG ipatests.pytest_ipa.integration.host.Host.master.cmd13:transport.py:558 [29/29]: configuring certmonger renewal for lightweight CAs DEBUG ipatests.pytest_ipa.integration.host.Host.master.cmd13:transport.py:558 Done configuring certificate server (pki-tomcatd). DEBUG ipatests.pytest_ipa.integration.host.Host.master.cmd13:transport.py:558 Configuring directory server (dirsrv) DEBUG ipatests.pytest_ipa.integration.host.Host.master.cmd13:transport.py:558 [1/3]: configuring TLS for DS instance DEBUG ipatests.pytest_ipa.integration.host.Host.master.cmd13:transport.py:558 [2/3]: adding CA certificate entry DEBUG ipatests.pytest_ipa.integration.host.Host.master.cmd13:transport.py:558 [3/3]: restarting directory server DEBUG ipatests.pytest_ipa.integration.host.Host.master.cmd13:transport.py:558 Done configuring directory server (dirsrv). DEBUG ipatests.pytest_ipa.integration.host.Host.master.cmd13:transport.py:558 Configuring ipa-otpd DEBUG ipatests.pytest_ipa.integration.host.Host.master.cmd13:transport.py:558 [1/2]: starting ipa-otpd DEBUG ipatests.pytest_ipa.integration.host.Host.master.cmd13:transport.py:558 [2/2]: configuring ipa-otpd to start on boot DEBUG ipatests.pytest_ipa.integration.host.Host.master.cmd13:transport.py:558 Done configuring ipa-otpd. DEBUG ipatests.pytest_ipa.integration.host.Host.master.cmd13:transport.py:558 Configuring the web interface (httpd) DEBUG ipatests.pytest_ipa.integration.host.Host.master.cmd13:transport.py:558 [1/21]: stopping httpd DEBUG ipatests.pytest_ipa.integration.host.Host.master.cmd13:transport.py:558 [2/21]: backing up ssl.conf DEBUG ipatests.pytest_ipa.integration.host.Host.master.cmd13:transport.py:558 [3/21]: disabling nss.conf DEBUG ipatests.pytest_ipa.integration.host.Host.master.cmd13:transport.py:558 [4/21]: configuring mod_ssl certificate paths DEBUG ipatests.pytest_ipa.integration.host.Host.master.cmd13:transport.py:558 [5/21]: setting mod_ssl protocol list DEBUG ipatests.pytest_ipa.integration.host.Host.master.cmd13:transport.py:558 [6/21]: configuring mod_ssl log directory DEBUG ipatests.pytest_ipa.integration.host.Host.master.cmd13:transport.py:558 [7/21]: disabling mod_ssl OCSP DEBUG ipatests.pytest_ipa.integration.host.Host.master.cmd13:transport.py:558 [8/21]: adding URL rewriting rules DEBUG ipatests.pytest_ipa.integration.host.Host.master.cmd13:transport.py:558 [9/21]: configuring httpd DEBUG ipatests.pytest_ipa.integration.host.Host.master.cmd13:transport.py:558 [10/21]: setting up httpd keytab DEBUG ipatests.pytest_ipa.integration.host.Host.master.cmd13:transport.py:558 [11/21]: configuring Gssproxy DEBUG ipatests.pytest_ipa.integration.host.Host.master.cmd13:transport.py:558 [12/21]: setting up ssl DEBUG ipatests.pytest_ipa.integration.host.Host.master.cmd13:transport.py:558 [13/21]: configure certmonger for renewals DEBUG ipatests.pytest_ipa.integration.host.Host.master.cmd13:transport.py:558 [14/21]: publish CA cert DEBUG ipatests.pytest_ipa.integration.host.Host.master.cmd13:transport.py:558 [15/21]: clean up any existing httpd ccaches DEBUG ipatests.pytest_ipa.integration.host.Host.master.cmd13:transport.py:558 [16/21]: configuring SELinux for httpd DEBUG ipatests.pytest_ipa.integration.host.Host.master.cmd13:transport.py:558 [17/21]: create KDC proxy config DEBUG ipatests.pytest_ipa.integration.host.Host.master.cmd13:transport.py:558 [18/21]: enable KDC proxy DEBUG ipatests.pytest_ipa.integration.host.Host.master.cmd13:transport.py:558 [19/21]: starting httpd DEBUG ipatests.pytest_ipa.integration.host.Host.master.cmd13:transport.py:558 [20/21]: configuring httpd to start on boot DEBUG ipatests.pytest_ipa.integration.host.Host.master.cmd13:transport.py:558 [21/21]: enabling oddjobd DEBUG ipatests.pytest_ipa.integration.host.Host.master.cmd13:transport.py:558 Done configuring the web interface (httpd). DEBUG ipatests.pytest_ipa.integration.host.Host.master.cmd13:transport.py:558 Configuring Kerberos KDC (krb5kdc) DEBUG ipatests.pytest_ipa.integration.host.Host.master.cmd13:transport.py:558 [1/1]: installing X509 Certificate for PKINIT DEBUG ipatests.pytest_ipa.integration.host.Host.master.cmd13:transport.py:558 Done configuring Kerberos KDC (krb5kdc). DEBUG ipatests.pytest_ipa.integration.host.Host.master.cmd13:transport.py:558 Applying LDAP updates DEBUG ipatests.pytest_ipa.integration.host.Host.master.cmd13:transport.py:558 Upgrading IPA:. Estimated time: 1 minute 30 seconds DEBUG ipatests.pytest_ipa.integration.host.Host.master.cmd13:transport.py:558 [1/11]: stopping directory server DEBUG ipatests.pytest_ipa.integration.host.Host.master.cmd13:transport.py:558 [2/11]: saving configuration DEBUG ipatests.pytest_ipa.integration.host.Host.master.cmd13:transport.py:558 [3/11]: disabling listeners DEBUG ipatests.pytest_ipa.integration.host.Host.master.cmd13:transport.py:558 [4/11]: enabling DS global lock DEBUG ipatests.pytest_ipa.integration.host.Host.master.cmd13:transport.py:558 [5/11]: disabling Schema Compat DEBUG ipatests.pytest_ipa.integration.host.Host.master.cmd13:transport.py:558 [6/11]: starting directory server DEBUG ipatests.pytest_ipa.integration.host.Host.master.cmd13:transport.py:558 [7/11]: updating schema DEBUG ipatests.pytest_ipa.integration.host.Host.master.cmd13:transport.py:558 [8/11]: upgrading server DEBUG ipatests.pytest_ipa.integration.host.Host.master.cmd13:transport.py:558 [9/11]: stopping directory server DEBUG ipatests.pytest_ipa.integration.host.Host.master.cmd13:transport.py:558 [10/11]: restoring configuration DEBUG ipatests.pytest_ipa.integration.host.Host.master.cmd13:transport.py:558 [11/11]: starting directory server DEBUG ipatests.pytest_ipa.integration.host.Host.master.cmd13:transport.py:558 Done. DEBUG ipatests.pytest_ipa.integration.host.Host.master.cmd13:transport.py:558 Restarting the KDC DEBUG ipatests.pytest_ipa.integration.host.Host.master.cmd13:transport.py:558 Configuring DNS (named) DEBUG ipatests.pytest_ipa.integration.host.Host.master.cmd13:transport.py:558 [1/12]: generating rndc key file DEBUG ipatests.pytest_ipa.integration.host.Host.master.cmd13:transport.py:558 [2/12]: adding DNS container DEBUG ipatests.pytest_ipa.integration.host.Host.master.cmd13:transport.py:558 [3/12]: setting up our zone DEBUG ipatests.pytest_ipa.integration.host.Host.master.cmd13:transport.py:558 [4/12]: setting up reverse zone DEBUG ipatests.pytest_ipa.integration.host.Host.master.cmd13:transport.py:558 [5/12]: setting up our own record DEBUG ipatests.pytest_ipa.integration.host.Host.master.cmd13:transport.py:558 [6/12]: setting up records for other masters DEBUG ipatests.pytest_ipa.integration.host.Host.master.cmd13:transport.py:558 [7/12]: adding NS record to the zones DEBUG ipatests.pytest_ipa.integration.host.Host.master.cmd13:transport.py:558 [8/12]: setting up kerberos principal DEBUG ipatests.pytest_ipa.integration.host.Host.master.cmd13:transport.py:558 [9/12]: setting up named.conf DEBUG ipatests.pytest_ipa.integration.host.Host.master.cmd13:transport.py:558 [10/12]: setting up server configuration DEBUG ipatests.pytest_ipa.integration.host.Host.master.cmd13:transport.py:558 [11/12]: configuring named to start on boot DEBUG ipatests.pytest_ipa.integration.host.Host.master.cmd13:transport.py:558 [12/12]: changing resolv.conf to point to ourselves DEBUG ipatests.pytest_ipa.integration.host.Host.master.cmd13:transport.py:558 Done configuring DNS (named). DEBUG ipatests.pytest_ipa.integration.host.Host.master.cmd13:transport.py:558 Restarting the web server to pick up resolv.conf changes DEBUG ipatests.pytest_ipa.integration.host.Host.master.cmd13:transport.py:558 Configuring DNS key synchronization service (ipa-dnskeysyncd) DEBUG ipatests.pytest_ipa.integration.host.Host.master.cmd13:transport.py:558 [1/7]: checking status DEBUG ipatests.pytest_ipa.integration.host.Host.master.cmd13:transport.py:558 [2/7]: setting up bind-dyndb-ldap working directory DEBUG ipatests.pytest_ipa.integration.host.Host.master.cmd13:transport.py:558 [3/7]: setting up kerberos principal DEBUG ipatests.pytest_ipa.integration.host.Host.master.cmd13:transport.py:558 [4/7]: setting up SoftHSM DEBUG ipatests.pytest_ipa.integration.host.Host.master.cmd13:transport.py:558 [5/7]: adding DNSSEC containers DEBUG ipatests.pytest_ipa.integration.host.Host.master.cmd13:transport.py:558 [6/7]: creating replica keys DEBUG ipatests.pytest_ipa.integration.host.Host.master.cmd13:transport.py:558 [7/7]: configuring ipa-dnskeysyncd to start on boot DEBUG ipatests.pytest_ipa.integration.host.Host.master.cmd13:transport.py:558 Done configuring DNS key synchronization service (ipa-dnskeysyncd). DEBUG ipatests.pytest_ipa.integration.host.Host.master.cmd13:transport.py:558 Restarting ipa-dnskeysyncd DEBUG ipatests.pytest_ipa.integration.host.Host.master.cmd13:transport.py:558 Restarting named DEBUG ipatests.pytest_ipa.integration.host.Host.master.cmd13:transport.py:558 Updating DNS system records DEBUG ipatests.pytest_ipa.integration.host.Host.master.cmd13:transport.py:558 Configuring client side components DEBUG ipatests.pytest_ipa.integration.host.Host.master.cmd13:transport.py:558 Using existing certificate '/etc/ipa/ca.crt'. DEBUG ipatests.pytest_ipa.integration.host.Host.master.cmd13:transport.py:558 Client hostname: master.ipa.test DEBUG ipatests.pytest_ipa.integration.host.Host.master.cmd13:transport.py:558 Realm: IPA.TEST DEBUG ipatests.pytest_ipa.integration.host.Host.master.cmd13:transport.py:558 DNS Domain: ipa.test DEBUG ipatests.pytest_ipa.integration.host.Host.master.cmd13:transport.py:558 IPA Server: master.ipa.test DEBUG ipatests.pytest_ipa.integration.host.Host.master.cmd13:transport.py:558 BaseDN: dc=ipa,dc=test DEBUG ipatests.pytest_ipa.integration.host.Host.master.cmd13:transport.py:558 Configured sudoers in /etc/authselect/user-nsswitch.conf DEBUG ipatests.pytest_ipa.integration.host.Host.master.cmd13:transport.py:558 Configured /etc/sssd/sssd.conf DEBUG ipatests.pytest_ipa.integration.host.Host.master.cmd13:transport.py:558 Systemwide CA database updated. DEBUG ipatests.pytest_ipa.integration.host.Host.master.cmd13:transport.py:558 Adding SSH public key from /etc/ssh/ssh_host_ecdsa_key.pub DEBUG ipatests.pytest_ipa.integration.host.Host.master.cmd13:transport.py:558 Adding SSH public key from /etc/ssh/ssh_host_ed25519_key.pub DEBUG ipatests.pytest_ipa.integration.host.Host.master.cmd13:transport.py:558 Adding SSH public key from /etc/ssh/ssh_host_rsa_key.pub DEBUG ipatests.pytest_ipa.integration.host.Host.master.cmd13:transport.py:558 SSSD enabled DEBUG ipatests.pytest_ipa.integration.host.Host.master.cmd13:transport.py:558 Configured /etc/openldap/ldap.conf DEBUG ipatests.pytest_ipa.integration.host.Host.master.cmd13:transport.py:558 Configured /etc/ssh/ssh_config DEBUG ipatests.pytest_ipa.integration.host.Host.master.cmd13:transport.py:558 Configured /etc/ssh/sshd_config DEBUG ipatests.pytest_ipa.integration.host.Host.master.cmd13:transport.py:558 Configuring ipa.test as NIS domain. DEBUG ipatests.pytest_ipa.integration.host.Host.master.cmd13:transport.py:558 Client configuration complete. DEBUG ipatests.pytest_ipa.integration.host.Host.master.cmd13:transport.py:558 The ipa-client-install command was successful DEBUG ipatests.pytest_ipa.integration.host.Host.master.cmd13:transport.py:558 This program will set up FreeIPA client. DEBUG ipatests.pytest_ipa.integration.host.Host.master.cmd13:transport.py:558 Version 4.9.0.dev DEBUG ipatests.pytest_ipa.integration.host.Host.master.cmd13:transport.py:558 DEBUG ipatests.pytest_ipa.integration.host.Host.master.cmd13:transport.py:558 DEBUG ipatests.pytest_ipa.integration.host.Host.master.cmd13:transport.py:558 The ipa-server-install command was successful DEBUG ipatests.pytest_ipa.integration.host.Host.master.cmd13:transport.py:558 DEBUG ipatests.pytest_ipa.integration.host.Host.master.cmd13:transport.py:558 ============================================================================== DEBUG ipatests.pytest_ipa.integration.host.Host.master.cmd13:transport.py:558 Setup complete DEBUG ipatests.pytest_ipa.integration.host.Host.master.cmd13:transport.py:558 DEBUG ipatests.pytest_ipa.integration.host.Host.master.cmd13:transport.py:558 Next steps: DEBUG ipatests.pytest_ipa.integration.host.Host.master.cmd13:transport.py:558 1. You must make sure these network ports are open: DEBUG ipatests.pytest_ipa.integration.host.Host.master.cmd13:transport.py:558 TCP Ports: DEBUG ipatests.pytest_ipa.integration.host.Host.master.cmd13:transport.py:558 * 80, 443: HTTP/HTTPS DEBUG ipatests.pytest_ipa.integration.host.Host.master.cmd13:transport.py:558 * 389, 636: LDAP/LDAPS DEBUG ipatests.pytest_ipa.integration.host.Host.master.cmd13:transport.py:558 * 88, 464: kerberos DEBUG ipatests.pytest_ipa.integration.host.Host.master.cmd13:transport.py:558 * 53: bind DEBUG ipatests.pytest_ipa.integration.host.Host.master.cmd13:transport.py:558 UDP Ports: DEBUG ipatests.pytest_ipa.integration.host.Host.master.cmd13:transport.py:558 * 88, 464: kerberos DEBUG ipatests.pytest_ipa.integration.host.Host.master.cmd13:transport.py:558 * 53: bind DEBUG ipatests.pytest_ipa.integration.host.Host.master.cmd13:transport.py:558 * 123: ntp DEBUG ipatests.pytest_ipa.integration.host.Host.master.cmd13:transport.py:558 DEBUG ipatests.pytest_ipa.integration.host.Host.master.cmd13:transport.py:558 2. You can now obtain a kerberos ticket using the command: 'kinit admin' DEBUG ipatests.pytest_ipa.integration.host.Host.master.cmd13:transport.py:558 This ticket will allow you to use the IPA tools (e.g., ipa user-add) DEBUG ipatests.pytest_ipa.integration.host.Host.master.cmd13:transport.py:558 and the web user interface. DEBUG ipatests.pytest_ipa.integration.host.Host.master.cmd13:transport.py:558 DEBUG ipatests.pytest_ipa.integration.host.Host.master.cmd13:transport.py:558 Be sure to back up the CA certificates stored in /root/cacert.p12 DEBUG ipatests.pytest_ipa.integration.host.Host.master.cmd13:transport.py:558 These files are required to create replicas. The password for these DEBUG ipatests.pytest_ipa.integration.host.Host.master.cmd13:transport.py:558 files is the Directory Manager password DEBUG ipatests.pytest_ipa.integration.host.Host.master.cmd13:transport.py:217 Exit code: 0 INFO ipatests.pytest_ipa.integration.host.Host.master.ParamikoTransport:transport.py:318 RUN ['firewall-cmd', '--add-service', 'freeipa-ldap', '--add-service', 'freeipa-ldaps', '--add-service', 'dns'] DEBUG ipatests.pytest_ipa.integration.host.Host.master.cmd14:transport.py:513 RUN ['firewall-cmd', '--add-service', 'freeipa-ldap', '--add-service', 'freeipa-ldaps', '--add-service', 'dns'] DEBUG ipatests.pytest_ipa.integration.host.Host.master.cmd14:transport.py:558 success DEBUG ipatests.pytest_ipa.integration.host.Host.master.cmd14:transport.py:217 Exit code: 0 INFO ipatests.pytest_ipa.integration.host.Host.master.ParamikoTransport:transport.py:318 RUN ['firewall-cmd', '--add-service', 'freeipa-ldap', '--add-service', 'freeipa-ldaps', '--add-service', 'dns', '--permanent'] DEBUG ipatests.pytest_ipa.integration.host.Host.master.cmd15:transport.py:513 RUN ['firewall-cmd', '--add-service', 'freeipa-ldap', '--add-service', 'freeipa-ldaps', '--add-service', 'dns', '--permanent'] DEBUG ipatests.pytest_ipa.integration.host.Host.master.cmd15:transport.py:558 success DEBUG ipatests.pytest_ipa.integration.host.Host.master.cmd15:transport.py:217 Exit code: 0 INFO ipatests.pytest_ipa.integration.tasks:tasks.py:305 Set LDAP debug level INFO ipatests.pytest_ipa.integration.host.Host.master.ParamikoTransport:transport.py:318 RUN ['ldapmodify', '-x', '-D', 'cn=Directory Manager', '-w', 'Secret.123'] DEBUG ipatests.pytest_ipa.integration.host.Host.master.cmd16:transport.py:513 RUN ['ldapmodify', '-x', '-D', 'cn=Directory Manager', '-w', 'Secret.123'] DEBUG ipatests.pytest_ipa.integration.host.Host.master.cmd16:transport.py:558 modifying entry "cn=config" DEBUG ipatests.pytest_ipa.integration.host.Host.master.cmd16:transport.py:558 DEBUG ipatests.pytest_ipa.integration.host.Host.master.cmd16:transport.py:217 Exit code: 0 INFO ipatests.pytest_ipa.integration.tasks:tasks.py:321 Set LDAP audit log INFO ipatests.pytest_ipa.integration.host.Host.master.ParamikoTransport:transport.py:318 RUN ['ldapmodify', '-x', '-D', 'cn=Directory Manager', '-w', 'Secret.123'] DEBUG ipatests.pytest_ipa.integration.host.Host.master.cmd17:transport.py:513 RUN ['ldapmodify', '-x', '-D', 'cn=Directory Manager', '-w', 'Secret.123'] DEBUG ipatests.pytest_ipa.integration.host.Host.master.cmd17:transport.py:558 modifying entry "cn=config" DEBUG ipatests.pytest_ipa.integration.host.Host.master.cmd17:transport.py:558 DEBUG ipatests.pytest_ipa.integration.host.Host.master.cmd17:transport.py:217 Exit code: 0 INFO ipatests.pytest_ipa.integration.host.Host.master.ParamikoTransport:transport.py:318 RUN ['sed', '-i', '/debug_level = 7/d', '/etc/sssd/sssd.conf'] DEBUG ipatests.pytest_ipa.integration.host.Host.master.cmd18:transport.py:513 RUN ['sed', '-i', '/debug_level = 7/d', '/etc/sssd/sssd.conf'] DEBUG ipatests.pytest_ipa.integration.host.Host.master.cmd18:transport.py:217 Exit code: 0 INFO ipatests.pytest_ipa.integration.host.Host.master.ParamikoTransport:transport.py:318 RUN ['sed', '-i', '/\\[*\\]/ a\\debug_level = 7', '/etc/sssd/sssd.conf'] DEBUG ipatests.pytest_ipa.integration.host.Host.master.cmd19:transport.py:513 RUN ['sed', '-i', '/\\[*\\]/ a\\debug_level = 7', '/etc/sssd/sssd.conf'] DEBUG ipatests.pytest_ipa.integration.host.Host.master.cmd19:transport.py:217 Exit code: 0 INFO ipatests.pytest_ipa.integration:__init__.py:261 Adding master.ipa.test:/var/log/sssd to list of logs to collect DEBUG ipatests.pytest_ipa.integration.host.Host.master.ParamikoTransport:transport.py:301 STAT /bin/systemctl INFO ipatests.pytest_ipa.integration.host.Host.master.ParamikoTransport:transport.py:318 RUN ['systemctl', 'stop', 'sssd'] DEBUG ipatests.pytest_ipa.integration.host.Host.master.cmd20:transport.py:513 RUN ['systemctl', 'stop', 'sssd'] DEBUG ipatests.pytest_ipa.integration.host.Host.master.cmd20:transport.py:217 Exit code: 0 INFO ipatests.pytest_ipa.integration.host.Host.master.ParamikoTransport:transport.py:318 RUN find /var/lib/sss/db -name '*.ldb' | xargs rm -fv DEBUG ipatests.pytest_ipa.integration.host.Host.master.cmd21:transport.py:513 RUN find /var/lib/sss/db -name '*.ldb' | xargs rm -fv DEBUG ipatests.pytest_ipa.integration.host.Host.master.cmd21:transport.py:558 removed '/var/lib/sss/db/config.ldb' DEBUG ipatests.pytest_ipa.integration.host.Host.master.cmd21:transport.py:558 removed '/var/lib/sss/db/timestamps_ipa.test.ldb' DEBUG ipatests.pytest_ipa.integration.host.Host.master.cmd21:transport.py:558 removed '/var/lib/sss/db/sssd.ldb' DEBUG ipatests.pytest_ipa.integration.host.Host.master.cmd21:transport.py:558 removed '/var/lib/sss/db/timestamps_implicit_files.ldb' DEBUG ipatests.pytest_ipa.integration.host.Host.master.cmd21:transport.py:558 removed '/var/lib/sss/db/cache_implicit_files.ldb' DEBUG ipatests.pytest_ipa.integration.host.Host.master.cmd21:transport.py:558 removed '/var/lib/sss/db/cache_ipa.test.ldb' DEBUG ipatests.pytest_ipa.integration.host.Host.master.cmd21:transport.py:217 Exit code: 0 INFO ipatests.pytest_ipa.integration.host.Host.master.ParamikoTransport:transport.py:318 RUN ['rm', '-fv', '/var/lib/sss/mc/group'] DEBUG ipatests.pytest_ipa.integration.host.Host.master.cmd22:transport.py:513 RUN ['rm', '-fv', '/var/lib/sss/mc/group'] DEBUG ipatests.pytest_ipa.integration.host.Host.master.cmd22:transport.py:558 removed '/var/lib/sss/mc/group' DEBUG ipatests.pytest_ipa.integration.host.Host.master.cmd22:transport.py:217 Exit code: 0 INFO ipatests.pytest_ipa.integration.host.Host.master.ParamikoTransport:transport.py:318 RUN ['rm', '-fv', '/var/lib/sss/mc/passwd'] DEBUG ipatests.pytest_ipa.integration.host.Host.master.cmd23:transport.py:513 RUN ['rm', '-fv', '/var/lib/sss/mc/passwd'] DEBUG ipatests.pytest_ipa.integration.host.Host.master.cmd23:transport.py:558 removed '/var/lib/sss/mc/passwd' DEBUG ipatests.pytest_ipa.integration.host.Host.master.cmd23:transport.py:217 Exit code: 0 INFO ipatests.pytest_ipa.integration.host.Host.master.ParamikoTransport:transport.py:318 RUN ['systemctl', 'start', 'sssd'] DEBUG ipatests.pytest_ipa.integration.host.Host.master.cmd24:transport.py:513 RUN ['systemctl', 'start', 'sssd'] DEBUG ipatests.pytest_ipa.integration.host.Host.master.cmd24:transport.py:217 Exit code: 0 INFO ipatests.pytest_ipa.integration.host.Host.master.ParamikoTransport:transport.py:318 RUN ['kinit', 'admin'] DEBUG ipatests.pytest_ipa.integration.host.Host.master.cmd25:transport.py:513 RUN ['kinit', 'admin'] DEBUG ipatests.pytest_ipa.integration.host.Host.master.cmd25:transport.py:558 Password for admin@IPA.TEST: DEBUG ipatests.pytest_ipa.integration.host.Host.master.cmd25:transport.py:217 Exit code: 0 INFO ipatests.pytest_ipa.integration.host.Host.master.ParamikoTransport:transport.py:318 RUN ['ipa', 'dnszone-mod', 'ipa.test', '--default-ttl', '1', '--ttl', '1'] DEBUG ipatests.pytest_ipa.integration.host.Host.master.cmd26:transport.py:513 RUN ['ipa', 'dnszone-mod', 'ipa.test', '--default-ttl', '1', '--ttl', '1'] DEBUG ipatests.pytest_ipa.integration.host.Host.master.cmd26:transport.py:558 ipa: WARNING: Service named-pkcs11.service requires restart on IPA server <all IPA DNS servers> to apply configuration changes. DEBUG ipatests.pytest_ipa.integration.host.Host.master.cmd26:transport.py:558 Zone name: ipa.test. DEBUG ipatests.pytest_ipa.integration.host.Host.master.cmd26:transport.py:558 Active zone: TRUE DEBUG ipatests.pytest_ipa.integration.host.Host.master.cmd26:transport.py:558 Authoritative nameserver: master.ipa.test. DEBUG ipatests.pytest_ipa.integration.host.Host.master.cmd26:transport.py:558 Administrator e-mail address: hostmaster.ipa.test. DEBUG ipatests.pytest_ipa.integration.host.Host.master.cmd26:transport.py:558 SOA serial: 1583194662 DEBUG ipatests.pytest_ipa.integration.host.Host.master.cmd26:transport.py:558 SOA refresh: 3600 DEBUG ipatests.pytest_ipa.integration.host.Host.master.cmd26:transport.py:558 SOA retry: 900 DEBUG ipatests.pytest_ipa.integration.host.Host.master.cmd26:transport.py:558 SOA expire: 1209600 DEBUG ipatests.pytest_ipa.integration.host.Host.master.cmd26:transport.py:558 SOA minimum: 3600 DEBUG ipatests.pytest_ipa.integration.host.Host.master.cmd26:transport.py:558 Time to live: 1 DEBUG ipatests.pytest_ipa.integration.host.Host.master.cmd26:transport.py:558 Default time to live: 1 DEBUG ipatests.pytest_ipa.integration.host.Host.master.cmd26:transport.py:558 BIND update policy: grant IPA.TEST krb5-self * A; grant IPA.TEST krb5-self * AAAA; grant IPA.TEST krb5-self * SSHFP; DEBUG ipatests.pytest_ipa.integration.host.Host.master.cmd26:transport.py:558 Dynamic update: TRUE DEBUG ipatests.pytest_ipa.integration.host.Host.master.cmd26:transport.py:558 Allow query: any; DEBUG ipatests.pytest_ipa.integration.host.Host.master.cmd26:transport.py:558 Allow transfer: none; DEBUG ipatests.pytest_ipa.integration.host.Host.master.cmd26:transport.py:217 Exit code: 0 INFO ipatests.pytest_ipa.integration.host.Host.master.ParamikoTransport:transport.py:318 RUN ['ipa', 'dnsrecord-show', 'ipa.test', 'client0.ipa.test.'] DEBUG ipatests.pytest_ipa.integration.host.Host.master.cmd27:transport.py:513 RUN ['ipa', 'dnsrecord-show', 'ipa.test', 'client0.ipa.test.'] DEBUG ipatests.pytest_ipa.integration.host.Host.master.cmd27:transport.py:558 ipa: ERROR: client0.ipa.test.: DNS resource record not found DEBUG ipatests.pytest_ipa.integration.host.Host.master.cmd27:transport.py:217 Exit code: 2 INFO ipatests.pytest_ipa.integration.host.Host.master.ParamikoTransport:transport.py:318 RUN ['ipa', 'dnsrecord-add', 'ipa.test', 'client0.ipa.test.', '--a-rec', '192.168.122.135'] DEBUG ipatests.pytest_ipa.integration.host.Host.master.cmd28:transport.py:513 RUN ['ipa', 'dnsrecord-add', 'ipa.test', 'client0.ipa.test.', '--a-rec', '192.168.122.135'] DEBUG ipatests.pytest_ipa.integration.host.Host.master.cmd28:transport.py:558 Record name: client0 DEBUG ipatests.pytest_ipa.integration.host.Host.master.cmd28:transport.py:558 A record: 192.168.122.135 DEBUG ipatests.pytest_ipa.integration.host.Host.master.cmd28:transport.py:217 Exit code: 0 INFO ipatests.pytest_ipa.integration.host.Host.master.ParamikoTransport:transport.py:318 RUN ['ipa', 'dnsrecord-show', 'ipa.test', 'master.ipa.test.'] DEBUG ipatests.pytest_ipa.integration.host.Host.master.cmd29:transport.py:513 RUN ['ipa', 'dnsrecord-show', 'ipa.test', 'master.ipa.test.'] DEBUG ipatests.pytest_ipa.integration.host.Host.master.cmd29:transport.py:558 Record name: master DEBUG ipatests.pytest_ipa.integration.host.Host.master.cmd29:transport.py:558 A record: 192.168.122.15 DEBUG ipatests.pytest_ipa.integration.host.Host.master.cmd29:transport.py:558 SSHFP record: 3 1 CB9AC5F1A08E52AE4F4C874941AA81F2099984FA, 3 2 6E13D263B821F482FDBEFDDB560FE854D116EBC85D8B7A7846682334 700559BE, 4 1 ABD2A1F838079B592CC7EEEF2E804C8F5858DE79, 4 2 6FE1D6CCCEE5FD67CC7FC589F2E2867298CC5BF6B5408B5ED01BBE0C 90743BB6, 1 1 DBBF89737BC047F078190CFCA9188D7AB2E5D252, 1 2 02508EB58E0D0F778FA07897C0891DF13A2399E8D2C20E346D18A696 BCA57B4C DEBUG ipatests.pytest_ipa.integration.host.Host.master.cmd29:transport.py:217 Exit code: 0 INFO ipatests.pytest_ipa.integration.host.Host.master.ParamikoTransport:transport.py:318 RUN ['ipa', 'dnsrecord-show', 'ipa.test', 'client1.ipa.test.'] DEBUG ipatests.pytest_ipa.integration.host.Host.master.cmd30:transport.py:513 RUN ['ipa', 'dnsrecord-show', 'ipa.test', 'client1.ipa.test.'] DEBUG ipatests.pytest_ipa.integration.host.Host.master.cmd30:transport.py:558 ipa: ERROR: client1.ipa.test.: DNS resource record not found DEBUG ipatests.pytest_ipa.integration.host.Host.master.cmd30:transport.py:217 Exit code: 2 INFO ipatests.pytest_ipa.integration.host.Host.master.ParamikoTransport:transport.py:318 RUN ['ipa', 'dnsrecord-add', 'ipa.test', 'client1.ipa.test.', '--a-rec', '192.168.122.221'] DEBUG ipatests.pytest_ipa.integration.host.Host.master.cmd31:transport.py:513 RUN ['ipa', 'dnsrecord-add', 'ipa.test', 'client1.ipa.test.', '--a-rec', '192.168.122.221'] DEBUG ipatests.pytest_ipa.integration.host.Host.master.cmd31:transport.py:558 Record name: client1 DEBUG ipatests.pytest_ipa.integration.host.Host.master.cmd31:transport.py:558 A record: 192.168.122.221 DEBUG ipatests.pytest_ipa.integration.host.Host.master.cmd31:transport.py:217 Exit code: 0 INFO ipatests.pytest_ipa.integration.tasks:tasks.py:1318 Installing client <Host master.ipa.test (master)> on <Host client0.ipa.test (client)> INFO ipatests.pytest_ipa.integration:__init__.py:261 Adding client0.ipa.test:/var/log/ipaclient-install.log to list of logs to collect INFO ipatests.pytest_ipa.integration.host.Host.client0.ParamikoTransport:transport.py:318 RUN ['true'] DEBUG ipatests.pytest_ipa.integration.host.Host.client0.cmd2:transport.py:513 RUN ['true'] DEBUG ipatests.pytest_ipa.integration.host.Host.client0.cmd2:transport.py:217 Exit code: 0 INFO ipatests.pytest_ipa.integration:__init__.py:261 Adding client0.ipa.test:/ipatests/env.sh to list of logs to collect DEBUG ipatests.pytest_ipa.integration.host.Host.client0.ParamikoTransport:transport.py:301 STAT /ipatests INFO ipatests.pytest_ipa.integration.host.Host.client0.ParamikoTransport:transport.py:293 WRITE /ipatests/env.sh DEBUG ipatests.pytest_ipa.integration.host.Host.client0.ParamikoTransport:transport.py:301 STAT /etc/hostname DEBUG ipatests.pytest_ipa.integration.host.Host.client0.ParamikoTransport:transport.py:301 STAT /ipatests/file_backup/etc DEBUG ipatests.pytest_ipa.integration.host.Host.client0.ParamikoTransport:transport.py:301 STAT /ipatests/file_backup DEBUG ipatests.pytest_ipa.integration.host.Host.client0.ParamikoTransport:transport.py:301 STAT /ipatests INFO ipatests.pytest_ipa.integration.host.Host.client0.ParamikoTransport:transport.py:312 MKDIR /ipatests/file_backup INFO ipatests.pytest_ipa.integration.host.Host.client0.ParamikoTransport:transport.py:312 MKDIR /ipatests/file_backup/etc INFO ipatests.pytest_ipa.integration.host.Host.client0.ParamikoTransport:transport.py:318 RUN ['cp', '-af', '/etc/hostname', '/ipatests/file_backup/etc/hostname'] DEBUG ipatests.pytest_ipa.integration.host.Host.client0.cmd3:transport.py:513 RUN ['cp', '-af', '/etc/hostname', '/ipatests/file_backup/etc/hostname'] DEBUG ipatests.pytest_ipa.integration.host.Host.client0.cmd3:transport.py:217 Exit code: 0 INFO ipatests.pytest_ipa.integration.host.Host.client0.ParamikoTransport:transport.py:293 WRITE /etc/hostname INFO ipatests.pytest_ipa.integration.host.Host.client0.ParamikoTransport:transport.py:318 RUN ['hostname', 'client0.ipa.test'] DEBUG ipatests.pytest_ipa.integration.host.Host.client0.cmd4:transport.py:513 RUN ['hostname', 'client0.ipa.test'] DEBUG ipatests.pytest_ipa.integration.host.Host.client0.cmd4:transport.py:217 Exit code: 0 INFO ipatests.pytest_ipa.integration.host.Host.client0.ParamikoTransport:transport.py:318 RUN hostname > '/ipatests/backup_hostname' DEBUG ipatests.pytest_ipa.integration.host.Host.client0.cmd5:transport.py:513 RUN hostname > '/ipatests/backup_hostname' DEBUG ipatests.pytest_ipa.integration.host.Host.client0.cmd5:transport.py:217 Exit code: 0 INFO ipatests.pytest_ipa.integration.host.Host.client0.ParamikoTransport:transport.py:318 RUN ['ss', '--all', '--tcp', '--udp', '--numeric', '--processes'] DEBUG ipatests.pytest_ipa.integration.host.Host.client0.cmd6:transport.py:513 RUN ['ss', '--all', '--tcp', '--udp', '--numeric', '--processes'] DEBUG ipatests.pytest_ipa.integration.host.Host.client0.cmd6:transport.py:558 Netid State Recv-Q Send-Q Local Address:Port Peer Address:Port Process DEBUG ipatests.pytest_ipa.integration.host.Host.client0.cmd6:transport.py:558 udp UNCONN 0 0 192.168.122.135%eth0:68 0.0.0.0:* users:(("NetworkManager",pid=1966,fd=20)) DEBUG ipatests.pytest_ipa.integration.host.Host.client0.cmd6:transport.py:558 udp UNCONN 0 0 127.0.0.1:323 0.0.0.0:* users:(("chronyd",pid=497,fd=6)) DEBUG ipatests.pytest_ipa.integration.host.Host.client0.cmd6:transport.py:558 udp UNCONN 0 0 [::1]:323 [::]:* users:(("chronyd",pid=497,fd=7)) DEBUG ipatests.pytest_ipa.integration.host.Host.client0.cmd6:transport.py:558 tcp LISTEN 0 128 0.0.0.0:22 0.0.0.0:* users:(("sshd",pid=568,fd=5)) DEBUG ipatests.pytest_ipa.integration.host.Host.client0.cmd6:transport.py:558 tcp ESTAB 0 0 192.168.122.135:22 192.168.122.69:58298 users:(("sshd",pid=18211,fd=5),("sshd",pid=18208,fd=5)) DEBUG ipatests.pytest_ipa.integration.host.Host.client0.cmd6:transport.py:558 tcp ESTAB 0 0 192.168.122.135:22 192.168.122.1:42690 users:(("sshd",pid=2682,fd=5),("sshd",pid=2660,fd=5)) DEBUG ipatests.pytest_ipa.integration.host.Host.client0.cmd6:transport.py:558 tcp LISTEN 0 128 [::]:22 [::]:* users:(("sshd",pid=568,fd=7)) DEBUG ipatests.pytest_ipa.integration.host.Host.client0.cmd6:transport.py:217 Exit code: 0 INFO ipatests.pytest_ipa.integration.host.Host.client0.ParamikoTransport:transport.py:318 RUN ['ss', '--all', '--tcp', '--udp', '--numeric', '--processes', '-o', 'state', 'all', '( sport = :749 or dport = :749 or sport = :464 or dport = :464 )'] DEBUG ipatests.pytest_ipa.integration.host.Host.client0.cmd7:transport.py:513 RUN ['ss', '--all', '--tcp', '--udp', '--numeric', '--processes', '-o', 'state', 'all', '( sport = :749 or dport = :749 or sport = :464 or dport = :464 )'] DEBUG ipatests.pytest_ipa.integration.host.Host.client0.cmd7:transport.py:558 Netid State Recv-Q Send-Q Local Address:Port Peer Address:Port Process DEBUG ipatests.pytest_ipa.integration.host.Host.client0.cmd7:transport.py:217 Exit code: 0 INFO ipatests.pytest_ipa.integration.host.Host.master.ParamikoTransport:transport.py:318 RUN ['kinit', 'admin'] DEBUG ipatests.pytest_ipa.integration.host.Host.master.cmd32:transport.py:513 RUN ['kinit', 'admin'] DEBUG ipatests.pytest_ipa.integration.host.Host.master.cmd32:transport.py:558 Password for admin@IPA.TEST: DEBUG ipatests.pytest_ipa.integration.host.Host.master.cmd32:transport.py:217 Exit code: 0 INFO ipatests.pytest_ipa.integration.host.Host.master.ParamikoTransport:transport.py:318 RUN ['ipa', 'dnsconfig-mod', '--allow-sync-ptr=true'] DEBUG ipatests.pytest_ipa.integration.host.Host.master.cmd33:transport.py:513 RUN ['ipa', 'dnsconfig-mod', '--allow-sync-ptr=true'] DEBUG ipatests.pytest_ipa.integration.host.Host.master.cmd33:transport.py:558 Allow PTR sync: TRUE DEBUG ipatests.pytest_ipa.integration.host.Host.master.cmd33:transport.py:558 IPA DNS servers: master.ipa.test DEBUG ipatests.pytest_ipa.integration.host.Host.master.cmd33:transport.py:217 Exit code: 0 INFO ipatests.pytest_ipa.integration.host.Host.master.ParamikoTransport:transport.py:318 RUN ['ipa', 'dnszone-add', '122.168.192.in-addr.arpa.'] DEBUG ipatests.pytest_ipa.integration.host.Host.master.cmd34:transport.py:513 RUN ['ipa', 'dnszone-add', '122.168.192.in-addr.arpa.'] DEBUG ipatests.pytest_ipa.integration.host.Host.master.cmd34:transport.py:558 ipa: ERROR: DNS zone with name "122.168.192.in-addr.arpa." already exists DEBUG ipatests.pytest_ipa.integration.host.Host.master.cmd34:transport.py:217 Exit code: 1 WARNING ipatests.pytest_ipa.integration.tasks:tasks.py:151 ipa: ERROR: DNS zone with name "122.168.192.in-addr.arpa." already exists INFO ipatests.pytest_ipa.integration.host.Host.client0.ParamikoTransport:transport.py:318 RUN ['ipa-client-install', '--domain', 'ipa.test', '--realm', 'IPA.TEST', '-p', 'admin', '-w', 'Secret.123', '--server', 'master.ipa.test', '-U', '--mkhomedir'] DEBUG ipatests.pytest_ipa.integration.host.Host.client0.cmd8:transport.py:513 RUN ['ipa-client-install', '--domain', 'ipa.test', '--realm', 'IPA.TEST', '-p', 'admin', '-w', 'Secret.123', '--server', 'master.ipa.test', '-U', '--mkhomedir'] DEBUG ipatests.pytest_ipa.integration.host.Host.client0.cmd8:transport.py:558 Client hostname: client0.ipa.test DEBUG ipatests.pytest_ipa.integration.host.Host.client0.cmd8:transport.py:558 Realm: IPA.TEST DEBUG ipatests.pytest_ipa.integration.host.Host.client0.cmd8:transport.py:558 DNS Domain: ipa.test DEBUG ipatests.pytest_ipa.integration.host.Host.client0.cmd8:transport.py:558 IPA Server: master.ipa.test DEBUG ipatests.pytest_ipa.integration.host.Host.client0.cmd8:transport.py:558 BaseDN: dc=ipa,dc=test DEBUG ipatests.pytest_ipa.integration.host.Host.client0.cmd8:transport.py:558 Synchronizing time DEBUG ipatests.pytest_ipa.integration.host.Host.client0.cmd8:transport.py:558 No SRV records of NTP servers found and no NTP server or pool address was provided. DEBUG ipatests.pytest_ipa.integration.host.Host.client0.cmd8:transport.py:558 Attempting to sync time with chronyc. DEBUG ipatests.pytest_ipa.integration.host.Host.client0.cmd8:transport.py:558 Process chronyc waitsync failed to sync time! DEBUG ipatests.pytest_ipa.integration.host.Host.client0.cmd8:transport.py:558 Unable to sync time with chrony server, assuming the time is in sync. Please check that 123 UDP port is opened, and any time server is on network. DEBUG ipatests.pytest_ipa.integration.host.Host.client0.cmd8:transport.py:558 Successfully retrieved CA cert DEBUG ipatests.pytest_ipa.integration.host.Host.client0.cmd8:transport.py:558 Subject: CN=Certificate Authority,O=IPA.TEST DEBUG ipatests.pytest_ipa.integration.host.Host.client0.cmd8:transport.py:558 Issuer: CN=Certificate Authority,O=IPA.TEST DEBUG ipatests.pytest_ipa.integration.host.Host.client0.cmd8:transport.py:558 Valid From: 2020-03-03 00:10:10 DEBUG ipatests.pytest_ipa.integration.host.Host.client0.cmd8:transport.py:558 Valid Until: 2040-03-03 00:10:10 DEBUG ipatests.pytest_ipa.integration.host.Host.client0.cmd8:transport.py:558 DEBUG ipatests.pytest_ipa.integration.host.Host.client0.cmd8:transport.py:558 Enrolled in IPA realm IPA.TEST DEBUG ipatests.pytest_ipa.integration.host.Host.client0.cmd8:transport.py:558 Created /etc/ipa/default.conf DEBUG ipatests.pytest_ipa.integration.host.Host.client0.cmd8:transport.py:558 Configured sudoers in /etc/authselect/user-nsswitch.conf DEBUG ipatests.pytest_ipa.integration.host.Host.client0.cmd8:transport.py:558 Configured /etc/sssd/sssd.conf DEBUG ipatests.pytest_ipa.integration.host.Host.client0.cmd8:transport.py:558 Configured /etc/krb5.conf for IPA realm IPA.TEST DEBUG ipatests.pytest_ipa.integration.host.Host.client0.cmd8:transport.py:558 Systemwide CA database updated. DEBUG ipatests.pytest_ipa.integration.host.Host.client0.cmd8:transport.py:558 Hostname (client0.ipa.test) does not have A/AAAA record. DEBUG ipatests.pytest_ipa.integration.host.Host.client0.cmd8:transport.py:558 Failed to update DNS records. DEBUG ipatests.pytest_ipa.integration.host.Host.client0.cmd8:transport.py:558 Missing A/AAAA record(s) for host client0.ipa.test: 192.168.122.135. DEBUG ipatests.pytest_ipa.integration.host.Host.client0.cmd8:transport.py:558 Missing reverse record(s) for address(es): 192.168.122.135. DEBUG ipatests.pytest_ipa.integration.host.Host.client0.cmd8:transport.py:558 Adding SSH public key from /etc/ssh/ssh_host_ecdsa_key.pub DEBUG ipatests.pytest_ipa.integration.host.Host.client0.cmd8:transport.py:558 Adding SSH public key from /etc/ssh/ssh_host_ed25519_key.pub DEBUG ipatests.pytest_ipa.integration.host.Host.client0.cmd8:transport.py:558 Adding SSH public key from /etc/ssh/ssh_host_rsa_key.pub DEBUG ipatests.pytest_ipa.integration.host.Host.client0.cmd8:transport.py:558 Could not update DNS SSHFP records. DEBUG ipatests.pytest_ipa.integration.host.Host.client0.cmd8:transport.py:558 SSSD enabled DEBUG ipatests.pytest_ipa.integration.host.Host.client0.cmd8:transport.py:558 Configured /etc/openldap/ldap.conf DEBUG ipatests.pytest_ipa.integration.host.Host.client0.cmd8:transport.py:558 Configured /etc/ssh/ssh_config DEBUG ipatests.pytest_ipa.integration.host.Host.client0.cmd8:transport.py:558 Configured /etc/ssh/sshd_config DEBUG ipatests.pytest_ipa.integration.host.Host.client0.cmd8:transport.py:558 Configuring ipa.test as NIS domain. DEBUG ipatests.pytest_ipa.integration.host.Host.client0.cmd8:transport.py:558 Client configuration complete. DEBUG ipatests.pytest_ipa.integration.host.Host.client0.cmd8:transport.py:558 The ipa-client-install command was successful DEBUG ipatests.pytest_ipa.integration.host.Host.client0.cmd8:transport.py:558 This program will set up FreeIPA client. DEBUG ipatests.pytest_ipa.integration.host.Host.client0.cmd8:transport.py:558 Version 4.9.0.dev DEBUG ipatests.pytest_ipa.integration.host.Host.client0.cmd8:transport.py:558 DEBUG ipatests.pytest_ipa.integration.host.Host.client0.cmd8:transport.py:558 DEBUG ipatests.pytest_ipa.integration.host.Host.client0.cmd8:transport.py:558 Using default chrony configuration. DEBUG ipatests.pytest_ipa.integration.host.Host.client0.cmd8:transport.py:217 Exit code: 0 INFO ipatests.pytest_ipa.integration.host.Host.client0.ParamikoTransport:transport.py:318 RUN ['sed', '-i', '/debug_level = 7/d', '/etc/sssd/sssd.conf'] DEBUG ipatests.pytest_ipa.integration.host.Host.client0.cmd9:transport.py:513 RUN ['sed', '-i', '/debug_level = 7/d', '/etc/sssd/sssd.conf'] DEBUG ipatests.pytest_ipa.integration.host.Host.client0.cmd9:transport.py:217 Exit code: 0 INFO ipatests.pytest_ipa.integration.host.Host.client0.ParamikoTransport:transport.py:318 RUN ['sed', '-i', '/\\[*\\]/ a\\debug_level = 7', '/etc/sssd/sssd.conf'] DEBUG ipatests.pytest_ipa.integration.host.Host.client0.cmd10:transport.py:513 RUN ['sed', '-i', '/\\[*\\]/ a\\debug_level = 7', '/etc/sssd/sssd.conf'] DEBUG ipatests.pytest_ipa.integration.host.Host.client0.cmd10:transport.py:217 Exit code: 0 INFO ipatests.pytest_ipa.integration:__init__.py:261 Adding client0.ipa.test:/var/log/sssd to list of logs to collect DEBUG ipatests.pytest_ipa.integration.host.Host.client0.ParamikoTransport:transport.py:301 STAT /bin/systemctl INFO ipatests.pytest_ipa.integration.host.Host.client0.ParamikoTransport:transport.py:318 RUN ['systemctl', 'stop', 'sssd'] DEBUG ipatests.pytest_ipa.integration.host.Host.client0.cmd11:transport.py:513 RUN ['systemctl', 'stop', 'sssd'] DEBUG ipatests.pytest_ipa.integration.host.Host.client0.cmd11:transport.py:217 Exit code: 0 INFO ipatests.pytest_ipa.integration.host.Host.client0.ParamikoTransport:transport.py:318 RUN find /var/lib/sss/db -name '*.ldb' | xargs rm -fv DEBUG ipatests.pytest_ipa.integration.host.Host.client0.cmd12:transport.py:513 RUN find /var/lib/sss/db -name '*.ldb' | xargs rm -fv DEBUG ipatests.pytest_ipa.integration.host.Host.client0.cmd12:transport.py:558 removed '/var/lib/sss/db/config.ldb' DEBUG ipatests.pytest_ipa.integration.host.Host.client0.cmd12:transport.py:558 removed '/var/lib/sss/db/timestamps_ipa.test.ldb' DEBUG ipatests.pytest_ipa.integration.host.Host.client0.cmd12:transport.py:558 removed '/var/lib/sss/db/sssd.ldb' DEBUG ipatests.pytest_ipa.integration.host.Host.client0.cmd12:transport.py:558 removed '/var/lib/sss/db/timestamps_implicit_files.ldb' DEBUG ipatests.pytest_ipa.integration.host.Host.client0.cmd12:transport.py:558 removed '/var/lib/sss/db/cache_implicit_files.ldb' DEBUG ipatests.pytest_ipa.integration.host.Host.client0.cmd12:transport.py:558 removed '/var/lib/sss/db/cache_ipa.test.ldb' DEBUG ipatests.pytest_ipa.integration.host.Host.client0.cmd12:transport.py:217 Exit code: 0 INFO ipatests.pytest_ipa.integration.host.Host.client0.ParamikoTransport:transport.py:318 RUN ['rm', '-fv', '/var/lib/sss/mc/group'] DEBUG ipatests.pytest_ipa.integration.host.Host.client0.cmd13:transport.py:513 RUN ['rm', '-fv', '/var/lib/sss/mc/group'] DEBUG ipatests.pytest_ipa.integration.host.Host.client0.cmd13:transport.py:558 removed '/var/lib/sss/mc/group' DEBUG ipatests.pytest_ipa.integration.host.Host.client0.cmd13:transport.py:217 Exit code: 0 INFO ipatests.pytest_ipa.integration.host.Host.client0.ParamikoTransport:transport.py:318 RUN ['rm', '-fv', '/var/lib/sss/mc/passwd'] DEBUG ipatests.pytest_ipa.integration.host.Host.client0.cmd14:transport.py:513 RUN ['rm', '-fv', '/var/lib/sss/mc/passwd'] DEBUG ipatests.pytest_ipa.integration.host.Host.client0.cmd14:transport.py:558 removed '/var/lib/sss/mc/passwd' DEBUG ipatests.pytest_ipa.integration.host.Host.client0.cmd14:transport.py:217 Exit code: 0 INFO ipatests.pytest_ipa.integration.host.Host.client0.ParamikoTransport:transport.py:318 RUN ['systemctl', 'start', 'sssd'] DEBUG ipatests.pytest_ipa.integration.host.Host.client0.cmd15:transport.py:513 RUN ['systemctl', 'start', 'sssd'] DEBUG ipatests.pytest_ipa.integration.host.Host.client0.cmd15:transport.py:217 Exit code: 0 INFO ipatests.pytest_ipa.integration.host.Host.client0.ParamikoTransport:transport.py:318 RUN ['kinit', 'admin'] DEBUG ipatests.pytest_ipa.integration.host.Host.client0.cmd16:transport.py:513 RUN ['kinit', 'admin'] DEBUG ipatests.pytest_ipa.integration.host.Host.client0.cmd16:transport.py:558 Password for admin@IPA.TEST: DEBUG ipatests.pytest_ipa.integration.host.Host.client0.cmd16:transport.py:217 Exit code: 0 INFO ipatests.pytest_ipa.integration.tasks:tasks.py:1318 Installing client <Host master.ipa.test (master)> on <Host client1.ipa.test (client)> INFO ipatests.pytest_ipa.integration:__init__.py:261 Adding client1.ipa.test:/var/log/ipaclient-install.log to list of logs to collect INFO ipatests.pytest_ipa.integration.host.Host.client1.ParamikoTransport:transport.py:318 RUN ['true'] DEBUG ipatests.pytest_ipa.integration.host.Host.client1.cmd2:transport.py:513 RUN ['true'] DEBUG ipatests.pytest_ipa.integration.host.Host.client1.cmd2:transport.py:217 Exit code: 0 INFO ipatests.pytest_ipa.integration:__init__.py:261 Adding client1.ipa.test:/ipatests/env.sh to list of logs to collect DEBUG ipatests.pytest_ipa.integration.host.Host.client1.ParamikoTransport:transport.py:301 STAT /ipatests INFO ipatests.pytest_ipa.integration.host.Host.client1.ParamikoTransport:transport.py:293 WRITE /ipatests/env.sh DEBUG ipatests.pytest_ipa.integration.host.Host.client1.ParamikoTransport:transport.py:301 STAT /etc/hostname DEBUG ipatests.pytest_ipa.integration.host.Host.client1.ParamikoTransport:transport.py:301 STAT /ipatests/file_backup/etc DEBUG ipatests.pytest_ipa.integration.host.Host.client1.ParamikoTransport:transport.py:301 STAT /ipatests/file_backup DEBUG ipatests.pytest_ipa.integration.host.Host.client1.ParamikoTransport:transport.py:301 STAT /ipatests INFO ipatests.pytest_ipa.integration.host.Host.client1.ParamikoTransport:transport.py:312 MKDIR /ipatests/file_backup INFO ipatests.pytest_ipa.integration.host.Host.client1.ParamikoTransport:transport.py:312 MKDIR /ipatests/file_backup/etc INFO ipatests.pytest_ipa.integration.host.Host.client1.ParamikoTransport:transport.py:318 RUN ['cp', '-af', '/etc/hostname', '/ipatests/file_backup/etc/hostname'] DEBUG ipatests.pytest_ipa.integration.host.Host.client1.cmd3:transport.py:513 RUN ['cp', '-af', '/etc/hostname', '/ipatests/file_backup/etc/hostname'] DEBUG ipatests.pytest_ipa.integration.host.Host.client1.cmd3:transport.py:217 Exit code: 0 INFO ipatests.pytest_ipa.integration.host.Host.client1.ParamikoTransport:transport.py:293 WRITE /etc/hostname INFO ipatests.pytest_ipa.integration.host.Host.client1.ParamikoTransport:transport.py:318 RUN ['hostname', 'client1.ipa.test'] DEBUG ipatests.pytest_ipa.integration.host.Host.client1.cmd4:transport.py:513 RUN ['hostname', 'client1.ipa.test'] DEBUG ipatests.pytest_ipa.integration.host.Host.client1.cmd4:transport.py:217 Exit code: 0 INFO ipatests.pytest_ipa.integration.host.Host.client1.ParamikoTransport:transport.py:318 RUN hostname > '/ipatests/backup_hostname' DEBUG ipatests.pytest_ipa.integration.host.Host.client1.cmd5:transport.py:513 RUN hostname > '/ipatests/backup_hostname' DEBUG ipatests.pytest_ipa.integration.host.Host.client1.cmd5:transport.py:217 Exit code: 0 INFO ipatests.pytest_ipa.integration.host.Host.client1.ParamikoTransport:transport.py:318 RUN ['ss', '--all', '--tcp', '--udp', '--numeric', '--processes'] DEBUG ipatests.pytest_ipa.integration.host.Host.client1.cmd6:transport.py:513 RUN ['ss', '--all', '--tcp', '--udp', '--numeric', '--processes'] DEBUG ipatests.pytest_ipa.integration.host.Host.client1.cmd6:transport.py:558 Netid State Recv-Q Send-Q Local Address:Port Peer Address:Port Process DEBUG ipatests.pytest_ipa.integration.host.Host.client1.cmd6:transport.py:558 udp UNCONN 0 0 127.0.0.1:323 0.0.0.0:* users:(("chronyd",pid=498,fd=6)) DEBUG ipatests.pytest_ipa.integration.host.Host.client1.cmd6:transport.py:558 udp UNCONN 0 0 192.168.122.221%eth0:68 0.0.0.0:* users:(("NetworkManager",pid=1966,fd=20)) DEBUG ipatests.pytest_ipa.integration.host.Host.client1.cmd6:transport.py:558 udp UNCONN 0 0 [::1]:323 [::]:* users:(("chronyd",pid=498,fd=7)) DEBUG ipatests.pytest_ipa.integration.host.Host.client1.cmd6:transport.py:558 tcp LISTEN 0 128 0.0.0.0:22 0.0.0.0:* users:(("sshd",pid=552,fd=4)) DEBUG ipatests.pytest_ipa.integration.host.Host.client1.cmd6:transport.py:558 tcp ESTAB 0 0 192.168.122.221:22 192.168.122.69:57074 users:(("sshd",pid=18430,fd=5),("sshd",pid=18427,fd=5)) DEBUG ipatests.pytest_ipa.integration.host.Host.client1.cmd6:transport.py:558 tcp ESTAB 0 0 192.168.122.221:22 192.168.122.1:33662 users:(("sshd",pid=2674,fd=5),("sshd",pid=2655,fd=5)) DEBUG ipatests.pytest_ipa.integration.host.Host.client1.cmd6:transport.py:558 tcp LISTEN 0 128 [::]:22 [::]:* users:(("sshd",pid=552,fd=6)) DEBUG ipatests.pytest_ipa.integration.host.Host.client1.cmd6:transport.py:217 Exit code: 0 INFO ipatests.pytest_ipa.integration.host.Host.client1.ParamikoTransport:transport.py:318 RUN ['ss', '--all', '--tcp', '--udp', '--numeric', '--processes', '-o', 'state', 'all', '( sport = :749 or dport = :749 or sport = :464 or dport = :464 )'] DEBUG ipatests.pytest_ipa.integration.host.Host.client1.cmd7:transport.py:513 RUN ['ss', '--all', '--tcp', '--udp', '--numeric', '--processes', '-o', 'state', 'all', '( sport = :749 or dport = :749 or sport = :464 or dport = :464 )'] DEBUG ipatests.pytest_ipa.integration.host.Host.client1.cmd7:transport.py:558 Netid State Recv-Q Send-Q Local Address:Port Peer Address:Port Process DEBUG ipatests.pytest_ipa.integration.host.Host.client1.cmd7:transport.py:217 Exit code: 0 INFO ipatests.pytest_ipa.integration.host.Host.master.ParamikoTransport:transport.py:318 RUN ['kinit', 'admin'] DEBUG ipatests.pytest_ipa.integration.host.Host.master.cmd35:transport.py:513 RUN ['kinit', 'admin'] DEBUG ipatests.pytest_ipa.integration.host.Host.master.cmd35:transport.py:558 Password for admin@IPA.TEST: DEBUG ipatests.pytest_ipa.integration.host.Host.master.cmd35:transport.py:217 Exit code: 0 INFO ipatests.pytest_ipa.integration.host.Host.master.ParamikoTransport:transport.py:318 RUN ['ipa', 'dnsconfig-mod', '--allow-sync-ptr=true'] DEBUG ipatests.pytest_ipa.integration.host.Host.master.cmd36:transport.py:513 RUN ['ipa', 'dnsconfig-mod', '--allow-sync-ptr=true'] DEBUG ipatests.pytest_ipa.integration.host.Host.master.cmd36:transport.py:558 ipa: ERROR: no modifications to be performed DEBUG ipatests.pytest_ipa.integration.host.Host.master.cmd36:transport.py:217 Exit code: 1 INFO ipatests.pytest_ipa.integration.host.Host.master.ParamikoTransport:transport.py:318 RUN ['ipa', 'dnszone-add', '122.168.192.in-addr.arpa.'] DEBUG ipatests.pytest_ipa.integration.host.Host.master.cmd37:transport.py:513 RUN ['ipa', 'dnszone-add', '122.168.192.in-addr.arpa.'] DEBUG ipatests.pytest_ipa.integration.host.Host.master.cmd37:transport.py:558 ipa: ERROR: DNS zone with name "122.168.192.in-addr.arpa." already exists DEBUG ipatests.pytest_ipa.integration.host.Host.master.cmd37:transport.py:217 Exit code: 1 WARNING ipatests.pytest_ipa.integration.tasks:tasks.py:151 ipa: ERROR: DNS zone with name "122.168.192.in-addr.arpa." already exists INFO ipatests.pytest_ipa.integration.host.Host.client1.ParamikoTransport:transport.py:318 RUN ['ipa-client-install', '--domain', 'ipa.test', '--realm', 'IPA.TEST', '-p', 'admin', '-w', 'Secret.123', '--server', 'master.ipa.test', '-U', '--mkhomedir'] DEBUG ipatests.pytest_ipa.integration.host.Host.client1.cmd8:transport.py:513 RUN ['ipa-client-install', '--domain', 'ipa.test', '--realm', 'IPA.TEST', '-p', 'admin', '-w', 'Secret.123', '--server', 'master.ipa.test', '-U', '--mkhomedir'] DEBUG ipatests.pytest_ipa.integration.host.Host.client1.cmd8:transport.py:558 Client hostname: client1.ipa.test DEBUG ipatests.pytest_ipa.integration.host.Host.client1.cmd8:transport.py:558 Realm: IPA.TEST DEBUG ipatests.pytest_ipa.integration.host.Host.client1.cmd8:transport.py:558 DNS Domain: ipa.test DEBUG ipatests.pytest_ipa.integration.host.Host.client1.cmd8:transport.py:558 IPA Server: master.ipa.test DEBUG ipatests.pytest_ipa.integration.host.Host.client1.cmd8:transport.py:558 BaseDN: dc=ipa,dc=test DEBUG ipatests.pytest_ipa.integration.host.Host.client1.cmd8:transport.py:558 Synchronizing time DEBUG ipatests.pytest_ipa.integration.host.Host.client1.cmd8:transport.py:558 No SRV records of NTP servers found and no NTP server or pool address was provided. DEBUG ipatests.pytest_ipa.integration.host.Host.client1.cmd8:transport.py:558 Attempting to sync time with chronyc. DEBUG ipatests.pytest_ipa.integration.host.Host.client1.cmd8:transport.py:558 Process chronyc waitsync failed to sync time! DEBUG ipatests.pytest_ipa.integration.host.Host.client1.cmd8:transport.py:558 Unable to sync time with chrony server, assuming the time is in sync. Please check that 123 UDP port is opened, and any time server is on network. DEBUG ipatests.pytest_ipa.integration.host.Host.client1.cmd8:transport.py:558 Successfully retrieved CA cert DEBUG ipatests.pytest_ipa.integration.host.Host.client1.cmd8:transport.py:558 Subject: CN=Certificate Authority,O=IPA.TEST DEBUG ipatests.pytest_ipa.integration.host.Host.client1.cmd8:transport.py:558 Issuer: CN=Certificate Authority,O=IPA.TEST DEBUG ipatests.pytest_ipa.integration.host.Host.client1.cmd8:transport.py:558 Valid From: 2020-03-03 00:10:10 DEBUG ipatests.pytest_ipa.integration.host.Host.client1.cmd8:transport.py:558 Valid Until: 2040-03-03 00:10:10 DEBUG ipatests.pytest_ipa.integration.host.Host.client1.cmd8:transport.py:558 DEBUG ipatests.pytest_ipa.integration.host.Host.client1.cmd8:transport.py:558 Enrolled in IPA realm IPA.TEST DEBUG ipatests.pytest_ipa.integration.host.Host.client1.cmd8:transport.py:558 Created /etc/ipa/default.conf DEBUG ipatests.pytest_ipa.integration.host.Host.client1.cmd8:transport.py:558 Configured sudoers in /etc/authselect/user-nsswitch.conf DEBUG ipatests.pytest_ipa.integration.host.Host.client1.cmd8:transport.py:558 Configured /etc/sssd/sssd.conf DEBUG ipatests.pytest_ipa.integration.host.Host.client1.cmd8:transport.py:558 Configured /etc/krb5.conf for IPA realm IPA.TEST DEBUG ipatests.pytest_ipa.integration.host.Host.client1.cmd8:transport.py:558 Systemwide CA database updated. DEBUG ipatests.pytest_ipa.integration.host.Host.client1.cmd8:transport.py:558 Hostname (client1.ipa.test) does not have A/AAAA record. DEBUG ipatests.pytest_ipa.integration.host.Host.client1.cmd8:transport.py:558 Failed to update DNS records. DEBUG ipatests.pytest_ipa.integration.host.Host.client1.cmd8:transport.py:558 Missing A/AAAA record(s) for host client1.ipa.test: 192.168.122.221. DEBUG ipatests.pytest_ipa.integration.host.Host.client1.cmd8:transport.py:558 Missing reverse record(s) for address(es): 192.168.122.221. DEBUG ipatests.pytest_ipa.integration.host.Host.client1.cmd8:transport.py:558 Adding SSH public key from /etc/ssh/ssh_host_ecdsa_key.pub DEBUG ipatests.pytest_ipa.integration.host.Host.client1.cmd8:transport.py:558 Adding SSH public key from /etc/ssh/ssh_host_ed25519_key.pub DEBUG ipatests.pytest_ipa.integration.host.Host.client1.cmd8:transport.py:558 Adding SSH public key from /etc/ssh/ssh_host_rsa_key.pub DEBUG ipatests.pytest_ipa.integration.host.Host.client1.cmd8:transport.py:558 Could not update DNS SSHFP records. DEBUG ipatests.pytest_ipa.integration.host.Host.client1.cmd8:transport.py:558 SSSD enabled DEBUG ipatests.pytest_ipa.integration.host.Host.client1.cmd8:transport.py:558 Configured /etc/openldap/ldap.conf DEBUG ipatests.pytest_ipa.integration.host.Host.client1.cmd8:transport.py:558 Configured /etc/ssh/ssh_config DEBUG ipatests.pytest_ipa.integration.host.Host.client1.cmd8:transport.py:558 Configured /etc/ssh/sshd_config DEBUG ipatests.pytest_ipa.integration.host.Host.client1.cmd8:transport.py:558 Configuring ipa.test as NIS domain. DEBUG ipatests.pytest_ipa.integration.host.Host.client1.cmd8:transport.py:558 Client configuration complete. DEBUG ipatests.pytest_ipa.integration.host.Host.client1.cmd8:transport.py:558 The ipa-client-install command was successful DEBUG ipatests.pytest_ipa.integration.host.Host.client1.cmd8:transport.py:558 This program will set up FreeIPA client. DEBUG ipatests.pytest_ipa.integration.host.Host.client1.cmd8:transport.py:558 Version 4.9.0.dev DEBUG ipatests.pytest_ipa.integration.host.Host.client1.cmd8:transport.py:558 DEBUG ipatests.pytest_ipa.integration.host.Host.client1.cmd8:transport.py:558 DEBUG ipatests.pytest_ipa.integration.host.Host.client1.cmd8:transport.py:558 Using default chrony configuration. DEBUG ipatests.pytest_ipa.integration.host.Host.client1.cmd8:transport.py:217 Exit code: 0 INFO ipatests.pytest_ipa.integration.host.Host.client1.ParamikoTransport:transport.py:318 RUN ['sed', '-i', '/debug_level = 7/d', '/etc/sssd/sssd.conf'] DEBUG ipatests.pytest_ipa.integration.host.Host.client1.cmd9:transport.py:513 RUN ['sed', '-i', '/debug_level = 7/d', '/etc/sssd/sssd.conf'] DEBUG ipatests.pytest_ipa.integration.host.Host.client1.cmd9:transport.py:217 Exit code: 0 INFO ipatests.pytest_ipa.integration.host.Host.client1.ParamikoTransport:transport.py:318 RUN ['sed', '-i', '/\\[*\\]/ a\\debug_level = 7', '/etc/sssd/sssd.conf'] DEBUG ipatests.pytest_ipa.integration.host.Host.client1.cmd10:transport.py:513 RUN ['sed', '-i', '/\\[*\\]/ a\\debug_level = 7', '/etc/sssd/sssd.conf'] DEBUG ipatests.pytest_ipa.integration.host.Host.client1.cmd10:transport.py:217 Exit code: 0 INFO ipatests.pytest_ipa.integration:__init__.py:261 Adding client1.ipa.test:/var/log/sssd to list of logs to collect DEBUG ipatests.pytest_ipa.integration.host.Host.client1.ParamikoTransport:transport.py:301 STAT /bin/systemctl INFO ipatests.pytest_ipa.integration.host.Host.client1.ParamikoTransport:transport.py:318 RUN ['systemctl', 'stop', 'sssd'] DEBUG ipatests.pytest_ipa.integration.host.Host.client1.cmd11:transport.py:513 RUN ['systemctl', 'stop', 'sssd'] DEBUG ipatests.pytest_ipa.integration.host.Host.client1.cmd11:transport.py:217 Exit code: 0 INFO ipatests.pytest_ipa.integration.host.Host.client1.ParamikoTransport:transport.py:318 RUN find /var/lib/sss/db -name '*.ldb' | xargs rm -fv DEBUG ipatests.pytest_ipa.integration.host.Host.client1.cmd12:transport.py:513 RUN find /var/lib/sss/db -name '*.ldb' | xargs rm -fv DEBUG ipatests.pytest_ipa.integration.host.Host.client1.cmd12:transport.py:558 removed '/var/lib/sss/db/config.ldb' DEBUG ipatests.pytest_ipa.integration.host.Host.client1.cmd12:transport.py:558 removed '/var/lib/sss/db/timestamps_ipa.test.ldb' DEBUG ipatests.pytest_ipa.integration.host.Host.client1.cmd12:transport.py:558 removed '/var/lib/sss/db/sssd.ldb' DEBUG ipatests.pytest_ipa.integration.host.Host.client1.cmd12:transport.py:558 removed '/var/lib/sss/db/timestamps_implicit_files.ldb' DEBUG ipatests.pytest_ipa.integration.host.Host.client1.cmd12:transport.py:558 removed '/var/lib/sss/db/cache_implicit_files.ldb' DEBUG ipatests.pytest_ipa.integration.host.Host.client1.cmd12:transport.py:558 removed '/var/lib/sss/db/cache_ipa.test.ldb' DEBUG ipatests.pytest_ipa.integration.host.Host.client1.cmd12:transport.py:217 Exit code: 0 INFO ipatests.pytest_ipa.integration.host.Host.client1.ParamikoTransport:transport.py:318 RUN ['rm', '-fv', '/var/lib/sss/mc/group'] DEBUG ipatests.pytest_ipa.integration.host.Host.client1.cmd13:transport.py:513 RUN ['rm', '-fv', '/var/lib/sss/mc/group'] DEBUG ipatests.pytest_ipa.integration.host.Host.client1.cmd13:transport.py:558 removed '/var/lib/sss/mc/group' DEBUG ipatests.pytest_ipa.integration.host.Host.client1.cmd13:transport.py:217 Exit code: 0 INFO ipatests.pytest_ipa.integration.host.Host.client1.ParamikoTransport:transport.py:318 RUN ['rm', '-fv', '/var/lib/sss/mc/passwd'] DEBUG ipatests.pytest_ipa.integration.host.Host.client1.cmd14:transport.py:513 RUN ['rm', '-fv', '/var/lib/sss/mc/passwd'] DEBUG ipatests.pytest_ipa.integration.host.Host.client1.cmd14:transport.py:558 removed '/var/lib/sss/mc/passwd' DEBUG ipatests.pytest_ipa.integration.host.Host.client1.cmd14:transport.py:217 Exit code: 0 INFO ipatests.pytest_ipa.integration.host.Host.client1.ParamikoTransport:transport.py:318 RUN ['systemctl', 'start', 'sssd'] DEBUG ipatests.pytest_ipa.integration.host.Host.client1.cmd15:transport.py:513 RUN ['systemctl', 'start', 'sssd'] DEBUG ipatests.pytest_ipa.integration.host.Host.client1.cmd15:transport.py:217 Exit code: 0 INFO ipatests.pytest_ipa.integration.host.Host.client1.ParamikoTransport:transport.py:318 RUN ['kinit', 'admin'] DEBUG ipatests.pytest_ipa.integration.host.Host.client1.cmd16:transport.py:513 RUN ['kinit', 'admin'] DEBUG ipatests.pytest_ipa.integration.host.Host.client1.cmd16:transport.py:558 Password for admin@IPA.TEST: DEBUG ipatests.pytest_ipa.integration.host.Host.client1.cmd16:transport.py:217 Exit code: 0 INFO ipatests.pytest_ipa.integration.host.Host.client1.ParamikoTransport:transport.py:293 WRITE /etc/resolv.conf INFO ipatests.pytest_ipa.integration:__init__.py:261 Adding master.ipa.test:/var/log/dirsrv/slapd-IPA-TEST/errors to list of logs to collect INFO ipatests.pytest_ipa.integration:__init__.py:261 Adding master.ipa.test:/var/log/dirsrv/slapd-IPA-TEST/access to list of logs to collect INFO ipatests.pytest_ipa.integration:__init__.py:261 Adding master.ipa.test:/var/log/dirsrv/slapd-IPA-TEST/audit to list of logs to collect INFO ipatests.pytest_ipa.integration:__init__.py:261 Adding master.ipa.test:/var/log/ipaserver-install.log to list of logs to collect INFO ipatests.pytest_ipa.integration:__init__.py:261 Adding master.ipa.test:/var/log/ipaserver-uninstall.log to list of logs to collect INFO ipatests.pytest_ipa.integration:__init__.py:261 Adding master.ipa.test:/var/log/ipaclient-install.log to list of logs to collect INFO ipatests.pytest_ipa.integration:__init__.py:261 Adding master.ipa.test:/var/log/ipaclient-uninstall.log to list of logs to collect INFO ipatests.pytest_ipa.integration:__init__.py:261 Adding master.ipa.test:/var/log/ipareplica-install.log to list of logs to collect INFO ipatests.pytest_ipa.integration:__init__.py:261 Adding master.ipa.test:/var/log/ipareplica-conncheck.log to list of logs to collect INFO ipatests.pytest_ipa.integration:__init__.py:261 Adding master.ipa.test:/var/log/ipareplica-ca-install.log to list of logs to collect INFO ipatests.pytest_ipa.integration:__init__.py:261 Adding master.ipa.test:/var/log/ipaserver-kra-install.log to list of logs to collect INFO ipatests.pytest_ipa.integration:__init__.py:261 Adding master.ipa.test:/var/log/ipa-custodia.audit.log to list of logs to collect INFO ipatests.pytest_ipa.integration:__init__.py:261 Adding master.ipa.test:/var/log/ipaclient-uninstall.log to list of logs to collect INFO ipatests.pytest_ipa.integration:__init__.py:261 Adding master.ipa.test:/var/log/iparestore.log to list of logs to collect INFO ipatests.pytest_ipa.integration:__init__.py:261 Adding master.ipa.test:/var/log/ipabackup.log to list of logs to collect INFO ipatests.pytest_ipa.integration:__init__.py:261 Adding master.ipa.test:/var/log/kadmind.log to list of logs to collect INFO ipatests.pytest_ipa.integration:__init__.py:261 Adding master.ipa.test:/var/log/krb5kdc.log to list of logs to collect INFO ipatests.pytest_ipa.integration:__init__.py:261 Adding master.ipa.test:/var/log/httpd/error_log to list of logs to collect INFO ipatests.pytest_ipa.integration:__init__.py:261 Adding master.ipa.test:/var/log/pki/ to list of logs to collect INFO ipatests.pytest_ipa.integration:__init__.py:261 Adding master.ipa.test:/var/log/audit/audit.log to list of logs to collect INFO ipatests.pytest_ipa.integration.host.Host.master.ParamikoTransport:transport.py:318 RUN ['kinit', 'admin'] DEBUG ipatests.pytest_ipa.integration.host.Host.master.cmd38:transport.py:513 RUN ['kinit', 'admin'] DEBUG ipatests.pytest_ipa.integration.host.Host.master.cmd38:transport.py:558 Password for admin@IPA.TEST: DEBUG ipatests.pytest_ipa.integration.host.Host.master.cmd38:transport.py:217 Exit code: 0 INFO ipatests.pytest_ipa.integration.host.Host.master.ParamikoTransport:transport.py:318 RUN ['ipa-adtrust-install', '-U', '--enable-compat', '--netbios-name', 'IPA', '-a', 'Secret.123', '--add-sids'] DEBUG ipatests.pytest_ipa.integration.host.Host.master.cmd39:transport.py:513 RUN ['ipa-adtrust-install', '-U', '--enable-compat', '--netbios-name', 'IPA', '-a', 'Secret.123', '--add-sids'] DEBUG ipatests.pytest_ipa.integration.host.Host.master.cmd39:transport.py:558 DEBUG ipatests.pytest_ipa.integration.host.Host.master.cmd39:transport.py:558 The log file for this installation can be found in /var/log/ipaserver-install.log DEBUG ipatests.pytest_ipa.integration.host.Host.master.cmd39:transport.py:558 ============================================================================== DEBUG ipatests.pytest_ipa.integration.host.Host.master.cmd39:transport.py:558 This program will setup components needed to establish trust to AD domains for DEBUG ipatests.pytest_ipa.integration.host.Host.master.cmd39:transport.py:558 the FreeIPA Server. DEBUG ipatests.pytest_ipa.integration.host.Host.master.cmd39:transport.py:558 DEBUG ipatests.pytest_ipa.integration.host.Host.master.cmd39:transport.py:558 This includes: DEBUG ipatests.pytest_ipa.integration.host.Host.master.cmd39:transport.py:558 * Configure Samba DEBUG ipatests.pytest_ipa.integration.host.Host.master.cmd39:transport.py:558 * Add trust related objects to FreeIPA LDAP server DEBUG ipatests.pytest_ipa.integration.host.Host.master.cmd39:transport.py:558 DEBUG ipatests.pytest_ipa.integration.host.Host.master.cmd39:transport.py:558 To accept the default shown in brackets, press the Enter key. DEBUG ipatests.pytest_ipa.integration.host.Host.master.cmd39:transport.py:558 DEBUG ipatests.pytest_ipa.integration.host.Host.master.cmd39:transport.py:558 WARNING: The smb.conf already exists. Running ipa-adtrust-install will break your existing samba configuration. DEBUG ipatests.pytest_ipa.integration.host.Host.master.cmd39:transport.py:558 DEBUG ipatests.pytest_ipa.integration.host.Host.master.cmd39:transport.py:558 DEBUG ipatests.pytest_ipa.integration.host.Host.master.cmd39:transport.py:558 Configuring CIFS DEBUG ipatests.pytest_ipa.integration.host.Host.master.cmd39:transport.py:558 [1/25]: validate server hostname DEBUG ipatests.pytest_ipa.integration.host.Host.master.cmd39:transport.py:558 [2/25]: stopping smbd DEBUG ipatests.pytest_ipa.integration.host.Host.master.cmd39:transport.py:558 [3/25]: creating samba domain object DEBUG ipatests.pytest_ipa.integration.host.Host.master.cmd39:transport.py:558 [4/25]: retrieve local idmap range DEBUG ipatests.pytest_ipa.integration.host.Host.master.cmd39:transport.py:558 [5/25]: creating samba config registry DEBUG ipatests.pytest_ipa.integration.host.Host.master.cmd39:transport.py:558 [6/25]: writing samba config file DEBUG ipatests.pytest_ipa.integration.host.Host.master.cmd39:transport.py:558 [7/25]: adding cifs Kerberos principal DEBUG ipatests.pytest_ipa.integration.host.Host.master.cmd39:transport.py:558 [8/25]: adding cifs and host Kerberos principals to the adtrust agents group DEBUG ipatests.pytest_ipa.integration.host.Host.master.cmd39:transport.py:558 [9/25]: check for cifs services defined on other replicas DEBUG ipatests.pytest_ipa.integration.host.Host.master.cmd39:transport.py:558 [10/25]: adding cifs principal to S4U2Proxy targets DEBUG ipatests.pytest_ipa.integration.host.Host.master.cmd39:transport.py:558 [11/25]: adding admin(group) SIDs DEBUG ipatests.pytest_ipa.integration.host.Host.master.cmd39:transport.py:558 [12/25]: adding RID bases DEBUG ipatests.pytest_ipa.integration.host.Host.master.cmd39:transport.py:558 [13/25]: updating Kerberos config DEBUG ipatests.pytest_ipa.integration.host.Host.master.cmd39:transport.py:558 'dns_lookup_kdc' already set to 'true', nothing to do. DEBUG ipatests.pytest_ipa.integration.host.Host.master.cmd39:transport.py:558 [14/25]: activating CLDAP plugin DEBUG ipatests.pytest_ipa.integration.host.Host.master.cmd39:transport.py:558 [15/25]: activating sidgen task DEBUG ipatests.pytest_ipa.integration.host.Host.master.cmd39:transport.py:558 [16/25]: map BUILTIN\Guests to nobody group DEBUG ipatests.pytest_ipa.integration.host.Host.master.cmd39:transport.py:558 [17/25]: configuring smbd to start on boot DEBUG ipatests.pytest_ipa.integration.host.Host.master.cmd39:transport.py:558 [18/25]: enabling trusted domains support for older clients via Schema Compatibility plugin DEBUG ipatests.pytest_ipa.integration.host.Host.master.cmd39:transport.py:558 [19/25]: restarting Directory Server to take MS PAC and LDAP plugins changes into account DEBUG ipatests.pytest_ipa.integration.host.Host.master.cmd39:transport.py:558 [20/25]: adding fallback group DEBUG ipatests.pytest_ipa.integration.host.Host.master.cmd39:transport.py:558 [21/25]: adding Default Trust View DEBUG ipatests.pytest_ipa.integration.host.Host.master.cmd39:transport.py:558 [22/25]: setting SELinux booleans DEBUG ipatests.pytest_ipa.integration.host.Host.master.cmd39:transport.py:558 [23/25]: starting CIFS services DEBUG ipatests.pytest_ipa.integration.host.Host.master.cmd39:transport.py:558 [24/25]: adding SIDs to existing users and groups DEBUG ipatests.pytest_ipa.integration.host.Host.master.cmd39:transport.py:558 This step may take considerable amount of time, please wait.. DEBUG ipatests.pytest_ipa.integration.host.Host.master.cmd39:transport.py:558 [25/25]: restarting smbd DEBUG ipatests.pytest_ipa.integration.host.Host.master.cmd39:transport.py:558 Done configuring CIFS. DEBUG ipatests.pytest_ipa.integration.host.Host.master.cmd39:transport.py:558 DEBUG ipatests.pytest_ipa.integration.host.Host.master.cmd39:transport.py:558 ============================================================================= DEBUG ipatests.pytest_ipa.integration.host.Host.master.cmd39:transport.py:558 Setup complete DEBUG ipatests.pytest_ipa.integration.host.Host.master.cmd39:transport.py:558 DEBUG ipatests.pytest_ipa.integration.host.Host.master.cmd39:transport.py:558 You must make sure these network ports are open: DEBUG ipatests.pytest_ipa.integration.host.Host.master.cmd39:transport.py:558 TCP Ports: DEBUG ipatests.pytest_ipa.integration.host.Host.master.cmd39:transport.py:558 * 135: epmap DEBUG ipatests.pytest_ipa.integration.host.Host.master.cmd39:transport.py:558 * 138: netbios-dgm DEBUG ipatests.pytest_ipa.integration.host.Host.master.cmd39:transport.py:558 * 139: netbios-ssn DEBUG ipatests.pytest_ipa.integration.host.Host.master.cmd39:transport.py:558 * 445: microsoft-ds DEBUG ipatests.pytest_ipa.integration.host.Host.master.cmd39:transport.py:558 * 1024..1300: epmap listener range DEBUG ipatests.pytest_ipa.integration.host.Host.master.cmd39:transport.py:558 * 3268: msft-gc DEBUG ipatests.pytest_ipa.integration.host.Host.master.cmd39:transport.py:558 UDP Ports: DEBUG ipatests.pytest_ipa.integration.host.Host.master.cmd39:transport.py:558 * 138: netbios-dgm DEBUG ipatests.pytest_ipa.integration.host.Host.master.cmd39:transport.py:558 * 139: netbios-ssn DEBUG ipatests.pytest_ipa.integration.host.Host.master.cmd39:transport.py:558 * 389: (C)LDAP DEBUG ipatests.pytest_ipa.integration.host.Host.master.cmd39:transport.py:558 * 445: microsoft-ds DEBUG ipatests.pytest_ipa.integration.host.Host.master.cmd39:transport.py:558 DEBUG ipatests.pytest_ipa.integration.host.Host.master.cmd39:transport.py:558 See the ipa-adtrust-install(1) man page for more details DEBUG ipatests.pytest_ipa.integration.host.Host.master.cmd39:transport.py:558 DEBUG ipatests.pytest_ipa.integration.host.Host.master.cmd39:transport.py:558 ============================================================================= DEBUG ipatests.pytest_ipa.integration.host.Host.master.cmd39:transport.py:558 DEBUG ipatests.pytest_ipa.integration.host.Host.master.cmd39:transport.py:217 Exit code: 0 INFO ipatests.pytest_ipa.integration.host.Host.master.ParamikoTransport:transport.py:318 RUN ['systemctl', 'unmask', 'firewalld'] DEBUG ipatests.pytest_ipa.integration.host.Host.master.cmd40:transport.py:513 RUN ['systemctl', 'unmask', 'firewalld'] DEBUG ipatests.pytest_ipa.integration.host.Host.master.cmd40:transport.py:217 Exit code: 0 INFO ipatests.pytest_ipa.integration.host.Host.master.ParamikoTransport:transport.py:318 RUN ['systemctl', 'enable', 'firewalld'] DEBUG ipatests.pytest_ipa.integration.host.Host.master.cmd41:transport.py:513 RUN ['systemctl', 'enable', 'firewalld'] DEBUG ipatests.pytest_ipa.integration.host.Host.master.cmd41:transport.py:217 Exit code: 0 INFO ipatests.pytest_ipa.integration.host.Host.master.ParamikoTransport:transport.py:318 RUN ['systemctl', 'start', 'firewalld'] DEBUG ipatests.pytest_ipa.integration.host.Host.master.cmd42:transport.py:513 RUN ['systemctl', 'start', 'firewalld'] DEBUG ipatests.pytest_ipa.integration.host.Host.master.cmd42:transport.py:217 Exit code: 0 INFO ipatests.pytest_ipa.integration.host.Host.master.ParamikoTransport:transport.py:318 RUN ['firewall-cmd', '--add-service', 'freeipa-trust'] DEBUG ipatests.pytest_ipa.integration.host.Host.master.cmd43:transport.py:513 RUN ['firewall-cmd', '--add-service', 'freeipa-trust'] DEBUG ipatests.pytest_ipa.integration.host.Host.master.cmd43:transport.py:558 success DEBUG ipatests.pytest_ipa.integration.host.Host.master.cmd43:transport.py:217 Exit code: 0 INFO ipatests.pytest_ipa.integration.host.Host.master.ParamikoTransport:transport.py:318 RUN ['firewall-cmd', '--add-service', 'freeipa-trust', '--permanent'] DEBUG ipatests.pytest_ipa.integration.host.Host.master.cmd44:transport.py:513 RUN ['firewall-cmd', '--add-service', 'freeipa-trust', '--permanent'] DEBUG ipatests.pytest_ipa.integration.host.Host.master.cmd44:transport.py:558 success DEBUG ipatests.pytest_ipa.integration.host.Host.master.cmd44:transport.py:217 Exit code: 0 INFO ipatests.pytest_ipa.integration.host.Host.master.ParamikoTransport:transport.py:318 RUN ['systemctl', 'restart', 'named-pkcs11.service'] DEBUG ipatests.pytest_ipa.integration.host.Host.master.cmd45:transport.py:513 RUN ['systemctl', 'restart', 'named-pkcs11.service'] DEBUG ipatests.pytest_ipa.integration.host.Host.master.cmd45:transport.py:217 Exit code: 0 INFO ipatests.pytest_ipa.integration.host.Host.master.ParamikoTransport:transport.py:318 RUN ['dig', 'SRV', '+short', '@localhost', '_ldap._tcp.ipa.test'] DEBUG ipatests.pytest_ipa.integration.host.Host.master.cmd46:transport.py:513 RUN ['dig', 'SRV', '+short', '@localhost', '_ldap._tcp.ipa.test'] DEBUG ipatests.pytest_ipa.integration.host.Host.master.cmd46:transport.py:217 Exit code: 0 INFO ipatests.pytest_ipa.integration.host.Host.master.ParamikoTransport:transport.py:318 RUN ['dig', 'SRV', '+short', '@localhost', '_ldap._tcp.ipa.test'] DEBUG ipatests.pytest_ipa.integration.host.Host.master.cmd47:transport.py:513 RUN ['dig', 'SRV', '+short', '@localhost', '_ldap._tcp.ipa.test'] DEBUG ipatests.pytest_ipa.integration.host.Host.master.cmd47:transport.py:558 0 100 389 master.ipa.test. DEBUG ipatests.pytest_ipa.integration.host.Host.master.cmd47:transport.py:217 Exit code: 0 INFO ipatests.pytest_ipa.integration.host.Host.master.ParamikoTransport:transport.py:318 RUN ['kinit', 'admin'] DEBUG ipatests.pytest_ipa.integration.host.Host.master.cmd48:transport.py:513 RUN ['kinit', 'admin'] DEBUG ipatests.pytest_ipa.integration.host.Host.master.cmd48:transport.py:558 Password for admin@IPA.TEST: DEBUG ipatests.pytest_ipa.integration.host.Host.master.cmd48:transport.py:217 Exit code: 0 DEBUG ipatests.pytest_ipa.integration.host.Host.master.ParamikoTransport:transport.py:301 STAT /etc/named.conf DEBUG ipatests.pytest_ipa.integration.host.Host.master.ParamikoTransport:transport.py:301 STAT /ipatests/file_backup/etc INFO ipatests.pytest_ipa.integration.host.Host.master.ParamikoTransport:transport.py:318 RUN ['cp', '-af', '/etc/named.conf', '/ipatests/file_backup/etc/named.conf'] DEBUG ipatests.pytest_ipa.integration.host.Host.master.cmd49:transport.py:513 RUN ['cp', '-af', '/etc/named.conf', '/ipatests/file_backup/etc/named.conf'] DEBUG ipatests.pytest_ipa.integration.host.Host.master.cmd49:transport.py:217 Exit code: 0 DEBUG ipatests.pytest_ipa.integration.host.Host.master.ParamikoTransport:transport.py:284 READ /etc/named.conf INFO ipatests.pytest_ipa.integration.host.Host.master.ParamikoTransport:transport.py:293 WRITE /etc/named.conf INFO ipatests.pytest_ipa.integration.host.Host.master.ParamikoTransport:transport.py:318 RUN ['systemctl', 'restart', 'named-pkcs11.service'] DEBUG ipatests.pytest_ipa.integration.host.Host.master.cmd50:transport.py:513 RUN ['systemctl', 'restart', 'named-pkcs11.service'] DEBUG ipatests.pytest_ipa.integration.host.Host.master.cmd50:transport.py:217 Exit code: 0 INFO ipatests.pytest_ipa.integration.host.Host.master.ParamikoTransport:transport.py:318 RUN ['ipa', 'dnsforwardzone-add', 'ad.test', '--forwarder', '192.168.122.56', '--forward-policy', 'only'] DEBUG ipatests.pytest_ipa.integration.host.Host.master.cmd51:transport.py:513 RUN ['ipa', 'dnsforwardzone-add', 'ad.test', '--forwarder', '192.168.122.56', '--forward-policy', 'only'] DEBUG ipatests.pytest_ipa.integration.host.Host.master.cmd51:transport.py:558 Server will check DNS forwarder(s). DEBUG ipatests.pytest_ipa.integration.host.Host.master.cmd51:transport.py:558 This may take some time, please wait ... DEBUG ipatests.pytest_ipa.integration.host.Host.master.cmd51:transport.py:558 Zone name: ad.test. DEBUG ipatests.pytest_ipa.integration.host.Host.master.cmd51:transport.py:558 Active zone: TRUE DEBUG ipatests.pytest_ipa.integration.host.Host.master.cmd51:transport.py:558 Zone forwarders: 192.168.122.56 DEBUG ipatests.pytest_ipa.integration.host.Host.master.cmd51:transport.py:558 Forward policy: only DEBUG ipatests.pytest_ipa.integration.host.Host.master.cmd51:transport.py:217 Exit code: 0 INFO paramiko.transport:transport.py:1819 Connected (version 2.0, client OpenSSH_8.2) DEBUG ipatests.pytest_ipa.integration.host.WinHost.ad-root.ParamikoTransport:transport.py:251 Authenticating with password using user Administrator INFO paramiko.transport:transport.py:1819 Authentication (password) successful! INFO ipatests.pytest_ipa.integration.host.WinHost.ad-root.ParamikoTransport:transport.py:318 RUN ['dnscmd', '/zoneadd', 'ipa.test', '/Forwarder', '192.168.122.15'] DEBUG ipatests.pytest_ipa.integration.host.WinHost.ad-root.cmd1:transport.py:513 RUN ['dnscmd', '/zoneadd', 'ipa.test', '/Forwarder', '192.168.122.15'] DEBUG ipatests.pytest_ipa.integration.host.WinHost.ad-root.cmd1:transport.py:558 Could not chdir to home directory /home/Administrator: No such file or directory DEBUG ipatests.pytest_ipa.integration.host.WinHost.ad-root.cmd1:transport.py:558 -bash: line 1: cd: /home/Administrator: No such file or directory DEBUG ipatests.pytest_ipa.integration.host.WinHost.ad-root.cmd1:transport.py:558 -bash: line 2: /home/Administrator/env.sh: No such file or directory DEBUG ipatests.pytest_ipa.integration.host.WinHost.ad-root.cmd1:transport.py:558 DNS Server . created zone ipa.test: DEBUG ipatests.pytest_ipa.integration.host.WinHost.ad-root.cmd1:transport.py:558 DEBUG ipatests.pytest_ipa.integration.host.WinHost.ad-root.cmd1:transport.py:558 Command completed successfully. DEBUG ipatests.pytest_ipa.integration.host.WinHost.ad-root.cmd1:transport.py:558 DEBUG ipatests.pytest_ipa.integration.host.WinHost.ad-root.cmd1:transport.py:558 TERM environment variable not set. DEBUG ipatests.pytest_ipa.integration.host.WinHost.ad-root.cmd1:transport.py:217 Exit code: 0 INFO ipatests.pytest_ipa.integration.host.Host.master.ParamikoTransport:transport.py:318 RUN ['kinit', '-kt', '/var/lib/ipa/gssproxy/http.keytab', 'HTTP/master.ipa.test'] DEBUG ipatests.pytest_ipa.integration.host.Host.master.cmd52:transport.py:513 RUN ['kinit', '-kt', '/var/lib/ipa/gssproxy/http.keytab', 'HTTP/master.ipa.test'] DEBUG ipatests.pytest_ipa.integration.host.Host.master.cmd52:transport.py:217 Exit code: 0 INFO ipatests.pytest_ipa.integration.host.Host.master.ParamikoTransport:transport.py:318 RUN ['systemctl', 'restart', 'krb5kdc.service'] DEBUG ipatests.pytest_ipa.integration.host.Host.master.cmd53:transport.py:513 RUN ['systemctl', 'restart', 'krb5kdc.service'] DEBUG ipatests.pytest_ipa.integration.host.Host.master.cmd53:transport.py:217 Exit code: 0 INFO ipatests.pytest_ipa.integration.host.Host.master.ParamikoTransport:transport.py:318 RUN ['kdestroy', '-A'] DEBUG ipatests.pytest_ipa.integration.host.Host.master.cmd54:transport.py:513 RUN ['kdestroy', '-A'] DEBUG ipatests.pytest_ipa.integration.host.Host.master.cmd54:transport.py:217 Exit code: 0 INFO ipatests.pytest_ipa.integration.host.Host.master.ParamikoTransport:transport.py:318 RUN ['kinit', 'admin'] DEBUG ipatests.pytest_ipa.integration.host.Host.master.cmd55:transport.py:513 RUN ['kinit', 'admin'] DEBUG ipatests.pytest_ipa.integration.host.Host.master.cmd55:transport.py:558 Password for admin@IPA.TEST: DEBUG ipatests.pytest_ipa.integration.host.Host.master.cmd55:transport.py:217 Exit code: 0 INFO ipatests.pytest_ipa.integration.host.Host.master.ParamikoTransport:transport.py:318 RUN ['klist'] DEBUG ipatests.pytest_ipa.integration.host.Host.master.cmd56:transport.py:513 RUN ['klist'] DEBUG ipatests.pytest_ipa.integration.host.Host.master.cmd56:transport.py:558 Ticket cache: KCM:0 DEBUG ipatests.pytest_ipa.integration.host.Host.master.cmd56:transport.py:558 Default principal: admin@IPA.TEST DEBUG ipatests.pytest_ipa.integration.host.Host.master.cmd56:transport.py:558 DEBUG ipatests.pytest_ipa.integration.host.Host.master.cmd56:transport.py:558 Valid starting Expires Service principal DEBUG ipatests.pytest_ipa.integration.host.Host.master.cmd56:transport.py:558 03/03/2020 00:20:31 03/04/2020 00:20:31 krbtgt/IPA.TEST@IPA.TEST DEBUG ipatests.pytest_ipa.integration.host.Host.master.cmd56:transport.py:217 Exit code: 0 INFO ipatests.pytest_ipa.integration.host.Host.master.ParamikoTransport:transport.py:318 RUN ['smbcontrol', 'all', 'debug', '100'] DEBUG ipatests.pytest_ipa.integration.host.Host.master.cmd57:transport.py:513 RUN ['smbcontrol', 'all', 'debug', '100'] DEBUG ipatests.pytest_ipa.integration.host.Host.master.cmd57:transport.py:217 Exit code: 0 INFO ipatests.pytest_ipa.integration.host.Host.master.ParamikoTransport:transport.py:318 RUN ['ipa', 'trust-add', '--type', 'ad', 'ad.test', '--two-way=true', '--admin', 'Administrator', '--password'] DEBUG ipatests.pytest_ipa.integration.host.Host.master.cmd58:transport.py:513 RUN ['ipa', 'trust-add', '--type', 'ad', 'ad.test', '--two-way=true', '--admin', 'Administrator', '--password'] DEBUG ipatests.pytest_ipa.integration.host.Host.master.cmd58:transport.py:558 ------------------------------------------------ DEBUG ipatests.pytest_ipa.integration.host.Host.master.cmd58:transport.py:558 Added Active Directory trust for realm "ad.test" DEBUG ipatests.pytest_ipa.integration.host.Host.master.cmd58:transport.py:558 ------------------------------------------------ DEBUG ipatests.pytest_ipa.integration.host.Host.master.cmd58:transport.py:558 Realm name: ad.test DEBUG ipatests.pytest_ipa.integration.host.Host.master.cmd58:transport.py:558 Domain NetBIOS name: AD DEBUG ipatests.pytest_ipa.integration.host.Host.master.cmd58:transport.py:558 Domain Security Identifier: S-1-5-21-3540055105-4186384300-3258504578 DEBUG ipatests.pytest_ipa.integration.host.Host.master.cmd58:transport.py:558 Trust direction: Two-way trust DEBUG ipatests.pytest_ipa.integration.host.Host.master.cmd58:transport.py:558 Trust type: Active Directory domain DEBUG ipatests.pytest_ipa.integration.host.Host.master.cmd58:transport.py:558 Trust status: Established and verified DEBUG ipatests.pytest_ipa.integration.host.Host.master.cmd58:transport.py:217 Exit code: 0 INFO ipatests.pytest_ipa.integration.host.Host.master.ParamikoTransport:transport.py:318 RUN ['smbcontrol', 'all', 'debug', '1'] DEBUG ipatests.pytest_ipa.integration.host.Host.master.cmd59:transport.py:513 RUN ['smbcontrol', 'all', 'debug', '1'] DEBUG ipatests.pytest_ipa.integration.host.Host.master.cmd59:transport.py:217 Exit code: 0 DEBUG ipatests.pytest_ipa.integration.host.Host.master.ParamikoTransport:transport.py:301 STAT /bin/systemctl INFO ipatests.pytest_ipa.integration.host.Host.master.ParamikoTransport:transport.py:318 RUN ['systemctl', 'stop', 'sssd'] DEBUG ipatests.pytest_ipa.integration.host.Host.master.cmd60:transport.py:513 RUN ['systemctl', 'stop', 'sssd'] DEBUG ipatests.pytest_ipa.integration.host.Host.master.cmd60:transport.py:217 Exit code: 0 INFO ipatests.pytest_ipa.integration.host.Host.master.ParamikoTransport:transport.py:318 RUN find /var/lib/sss/db -name '*.ldb' | xargs rm -fv DEBUG ipatests.pytest_ipa.integration.host.Host.master.cmd61:transport.py:513 RUN find /var/lib/sss/db -name '*.ldb' | xargs rm -fv DEBUG ipatests.pytest_ipa.integration.host.Host.master.cmd61:transport.py:558 removed '/var/lib/sss/db/config.ldb' DEBUG ipatests.pytest_ipa.integration.host.Host.master.cmd61:transport.py:558 removed '/var/lib/sss/db/timestamps_ipa.test.ldb' DEBUG ipatests.pytest_ipa.integration.host.Host.master.cmd61:transport.py:558 removed '/var/lib/sss/db/sssd.ldb' DEBUG ipatests.pytest_ipa.integration.host.Host.master.cmd61:transport.py:558 removed '/var/lib/sss/db/timestamps_implicit_files.ldb' DEBUG ipatests.pytest_ipa.integration.host.Host.master.cmd61:transport.py:558 removed '/var/lib/sss/db/cache_implicit_files.ldb' DEBUG ipatests.pytest_ipa.integration.host.Host.master.cmd61:transport.py:558 removed '/var/lib/sss/db/cache_ipa.test.ldb' DEBUG ipatests.pytest_ipa.integration.host.Host.master.cmd61:transport.py:217 Exit code: 0 INFO ipatests.pytest_ipa.integration.host.Host.master.ParamikoTransport:transport.py:318 RUN ['rm', '-fv', '/var/lib/sss/mc/group'] DEBUG ipatests.pytest_ipa.integration.host.Host.master.cmd62:transport.py:513 RUN ['rm', '-fv', '/var/lib/sss/mc/group'] DEBUG ipatests.pytest_ipa.integration.host.Host.master.cmd62:transport.py:558 removed '/var/lib/sss/mc/group' DEBUG ipatests.pytest_ipa.integration.host.Host.master.cmd62:transport.py:217 Exit code: 0 INFO ipatests.pytest_ipa.integration.host.Host.master.ParamikoTransport:transport.py:318 RUN ['rm', '-fv', '/var/lib/sss/mc/passwd'] DEBUG ipatests.pytest_ipa.integration.host.Host.master.cmd63:transport.py:513 RUN ['rm', '-fv', '/var/lib/sss/mc/passwd'] DEBUG ipatests.pytest_ipa.integration.host.Host.master.cmd63:transport.py:558 removed '/var/lib/sss/mc/passwd' DEBUG ipatests.pytest_ipa.integration.host.Host.master.cmd63:transport.py:217 Exit code: 0 INFO ipatests.pytest_ipa.integration.host.Host.master.ParamikoTransport:transport.py:318 RUN ['systemctl', 'start', 'sssd'] DEBUG ipatests.pytest_ipa.integration.host.Host.master.cmd64:transport.py:513 RUN ['systemctl', 'start', 'sssd'] DEBUG ipatests.pytest_ipa.integration.host.Host.master.cmd64:transport.py:217 Exit code: 0 INFO ipatests.pytest_ipa.integration.host.Host.master.ParamikoTransport:transport.py:318 RUN ['systemctl', 'restart', 'krb5kdc.service'] DEBUG ipatests.pytest_ipa.integration.host.Host.master.cmd65:transport.py:513 RUN ['systemctl', 'restart', 'krb5kdc.service'] DEBUG ipatests.pytest_ipa.integration.host.Host.master.cmd65:transport.py:217 Exit code: 0 INFO ipatests.pytest_ipa.integration.host.Host.master.ParamikoTransport:transport.py:318 RUN ['kinit', 'admin'] DEBUG ipatests.pytest_ipa.integration.host.Host.master.cmd66:transport.py:513 RUN ['kinit', 'admin'] DEBUG ipatests.pytest_ipa.integration.host.Host.master.cmd66:transport.py:558 Password for admin@IPA.TEST: DEBUG ipatests.pytest_ipa.integration.host.Host.master.cmd66:transport.py:217 Exit code: 0 INFO ipatests.pytest_ipa.integration.host.Host.master.ParamikoTransport:transport.py:318 RUN ['ipa', 'user-add', 'user1', '--first', 'test', '--last', 'user', '--password'] DEBUG ipatests.pytest_ipa.integration.host.Host.master.cmd67:transport.py:513 RUN ['ipa', 'user-add', 'user1', '--first', 'test', '--last', 'user', '--password'] DEBUG ipatests.pytest_ipa.integration.host.Host.master.cmd67:transport.py:558 ------------------ DEBUG ipatests.pytest_ipa.integration.host.Host.master.cmd67:transport.py:558 Added user "user1" DEBUG ipatests.pytest_ipa.integration.host.Host.master.cmd67:transport.py:558 ------------------ DEBUG ipatests.pytest_ipa.integration.host.Host.master.cmd67:transport.py:558 User login: user1 DEBUG ipatests.pytest_ipa.integration.host.Host.master.cmd67:transport.py:558 First name: test DEBUG ipatests.pytest_ipa.integration.host.Host.master.cmd67:transport.py:558 Last name: user DEBUG ipatests.pytest_ipa.integration.host.Host.master.cmd67:transport.py:558 Full name: test user DEBUG ipatests.pytest_ipa.integration.host.Host.master.cmd67:transport.py:558 Display name: test user DEBUG ipatests.pytest_ipa.integration.host.Host.master.cmd67:transport.py:558 Initials: tu DEBUG ipatests.pytest_ipa.integration.host.Host.master.cmd67:transport.py:558 Home directory: /home/user1 DEBUG ipatests.pytest_ipa.integration.host.Host.master.cmd67:transport.py:558 GECOS: test user DEBUG ipatests.pytest_ipa.integration.host.Host.master.cmd67:transport.py:558 Login shell: /bin/sh DEBUG ipatests.pytest_ipa.integration.host.Host.master.cmd67:transport.py:558 Principal name: user1@IPA.TEST DEBUG ipatests.pytest_ipa.integration.host.Host.master.cmd67:transport.py:558 Principal alias: user1@IPA.TEST DEBUG ipatests.pytest_ipa.integration.host.Host.master.cmd67:transport.py:558 User password expiration: 20200303002228Z DEBUG ipatests.pytest_ipa.integration.host.Host.master.cmd67:transport.py:558 Email address: user1@ipa.test DEBUG ipatests.pytest_ipa.integration.host.Host.master.cmd67:transport.py:558 UID: 1877600004 DEBUG ipatests.pytest_ipa.integration.host.Host.master.cmd67:transport.py:558 GID: 1877600004 DEBUG ipatests.pytest_ipa.integration.host.Host.master.cmd67:transport.py:558 Password: True DEBUG ipatests.pytest_ipa.integration.host.Host.master.cmd67:transport.py:558 Member of groups: ipausers DEBUG ipatests.pytest_ipa.integration.host.Host.master.cmd67:transport.py:558 Kerberos keys available: True DEBUG ipatests.pytest_ipa.integration.host.Host.master.cmd67:transport.py:217 Exit code: 0 INFO ipatests.pytest_ipa.integration.host.Host.master.ParamikoTransport:transport.py:318 RUN ['kinit', 'user1'] DEBUG ipatests.pytest_ipa.integration.host.Host.master.cmd68:transport.py:513 RUN ['kinit', 'user1'] DEBUG ipatests.pytest_ipa.integration.host.Host.master.cmd68:transport.py:558 Password for user1@IPA.TEST: DEBUG ipatests.pytest_ipa.integration.host.Host.master.cmd68:transport.py:558 Password expired. You must change it now. DEBUG ipatests.pytest_ipa.integration.host.Host.master.cmd68:transport.py:558 Enter new password: DEBUG ipatests.pytest_ipa.integration.host.Host.master.cmd68:transport.py:558 Enter it again: DEBUG ipatests.pytest_ipa.integration.host.Host.master.cmd68:transport.py:217 Exit code: 0 INFO ipatests.pytest_ipa.integration.host.Host.master.ParamikoTransport:transport.py:318 RUN ['kdestroy', '-A'] DEBUG ipatests.pytest_ipa.integration.host.Host.master.cmd69:transport.py:513 RUN ['kdestroy', '-A'] DEBUG ipatests.pytest_ipa.integration.host.Host.master.cmd69:transport.py:217 Exit code: 0 INFO ipatests.pytest_ipa.integration.host.Host.master.ParamikoTransport:transport.py:318 RUN ['kinit', 'admin'] DEBUG ipatests.pytest_ipa.integration.host.Host.master.cmd70:transport.py:513 RUN ['kinit', 'admin'] DEBUG ipatests.pytest_ipa.integration.host.Host.master.cmd70:transport.py:558 Password for admin@IPA.TEST: DEBUG ipatests.pytest_ipa.integration.host.Host.master.cmd70:transport.py:217 Exit code: 0 INFO ipatests.pytest_ipa.integration.host.Host.master.ParamikoTransport:transport.py:318 RUN ['ipa', 'user-add', 'user2', '--first', 'test', '--last', 'user', '--password'] DEBUG ipatests.pytest_ipa.integration.host.Host.master.cmd71:transport.py:513 RUN ['ipa', 'user-add', 'user2', '--first', 'test', '--last', 'user', '--password'] DEBUG ipatests.pytest_ipa.integration.host.Host.master.cmd71:transport.py:558 ------------------ DEBUG ipatests.pytest_ipa.integration.host.Host.master.cmd71:transport.py:558 Added user "user2" DEBUG ipatests.pytest_ipa.integration.host.Host.master.cmd71:transport.py:558 ------------------ DEBUG ipatests.pytest_ipa.integration.host.Host.master.cmd71:transport.py:558 User login: user2 DEBUG ipatests.pytest_ipa.integration.host.Host.master.cmd71:transport.py:558 First name: test DEBUG ipatests.pytest_ipa.integration.host.Host.master.cmd71:transport.py:558 Last name: user DEBUG ipatests.pytest_ipa.integration.host.Host.master.cmd71:transport.py:558 Full name: test user DEBUG ipatests.pytest_ipa.integration.host.Host.master.cmd71:transport.py:558 Display name: test user DEBUG ipatests.pytest_ipa.integration.host.Host.master.cmd71:transport.py:558 Initials: tu DEBUG ipatests.pytest_ipa.integration.host.Host.master.cmd71:transport.py:558 Home directory: /home/user2 DEBUG ipatests.pytest_ipa.integration.host.Host.master.cmd71:transport.py:558 GECOS: test user DEBUG ipatests.pytest_ipa.integration.host.Host.master.cmd71:transport.py:558 Login shell: /bin/sh DEBUG ipatests.pytest_ipa.integration.host.Host.master.cmd71:transport.py:558 Principal name: user2@IPA.TEST DEBUG ipatests.pytest_ipa.integration.host.Host.master.cmd71:transport.py:558 Principal alias: user2@IPA.TEST DEBUG ipatests.pytest_ipa.integration.host.Host.master.cmd71:transport.py:558 User password expiration: 20200303002230Z DEBUG ipatests.pytest_ipa.integration.host.Host.master.cmd71:transport.py:558 Email address: user2@ipa.test DEBUG ipatests.pytest_ipa.integration.host.Host.master.cmd71:transport.py:558 UID: 1877600005 DEBUG ipatests.pytest_ipa.integration.host.Host.master.cmd71:transport.py:558 GID: 1877600005 DEBUG ipatests.pytest_ipa.integration.host.Host.master.cmd71:transport.py:558 Password: True DEBUG ipatests.pytest_ipa.integration.host.Host.master.cmd71:transport.py:558 Member of groups: ipausers DEBUG ipatests.pytest_ipa.integration.host.Host.master.cmd71:transport.py:558 Kerberos keys available: True DEBUG ipatests.pytest_ipa.integration.host.Host.master.cmd71:transport.py:217 Exit code: 0 INFO ipatests.pytest_ipa.integration.host.Host.master.ParamikoTransport:transport.py:318 RUN ['kinit', 'user2'] DEBUG ipatests.pytest_ipa.integration.host.Host.master.cmd72:transport.py:513 RUN ['kinit', 'user2'] DEBUG ipatests.pytest_ipa.integration.host.Host.master.cmd72:transport.py:558 Password for user2@IPA.TEST: DEBUG ipatests.pytest_ipa.integration.host.Host.master.cmd72:transport.py:558 Password expired. You must change it now. DEBUG ipatests.pytest_ipa.integration.host.Host.master.cmd72:transport.py:558 Enter new password: DEBUG ipatests.pytest_ipa.integration.host.Host.master.cmd72:transport.py:558 Enter it again: DEBUG ipatests.pytest_ipa.integration.host.Host.master.cmd72:transport.py:217 Exit code: 0 INFO ipatests.pytest_ipa.integration.host.Host.master.ParamikoTransport:transport.py:318 RUN ['kdestroy', '-A'] DEBUG ipatests.pytest_ipa.integration.host.Host.master.cmd73:transport.py:513 RUN ['kdestroy', '-A'] DEBUG ipatests.pytest_ipa.integration.host.Host.master.cmd73:transport.py:217 Exit code: 0 INFO ipatests.pytest_ipa.integration.host.Host.client0.ParamikoTransport:transport.py:318 RUN ['su', '-l', 'user1', '-c', 'stat .'] DEBUG ipatests.pytest_ipa.integration.host.Host.client0.cmd17:transport.py:513 RUN ['su', '-l', 'user1', '-c', 'stat .'] DEBUG ipatests.pytest_ipa.integration.host.Host.client0.cmd17:transport.py:558 File: . DEBUG ipatests.pytest_ipa.integration.host.Host.client0.cmd17:transport.py:558 Size: 4096 Blocks: 8 IO Block: 4096 directory DEBUG ipatests.pytest_ipa.integration.host.Host.client0.cmd17:transport.py:558 Device: fc01h/64513d Inode: 524303 Links: 3 DEBUG ipatests.pytest_ipa.integration.host.Host.client0.cmd17:transport.py:558 Access: (0700/drwx------) Uid: (1877600004/ user1) Gid: (1877600004/ user1) DEBUG ipatests.pytest_ipa.integration.host.Host.client0.cmd17:transport.py:558 Context: unconfined_u:object_r:user_home_dir_t:s0 DEBUG ipatests.pytest_ipa.integration.host.Host.client0.cmd17:transport.py:558 Access: 2020-03-03 00:22:32.645701947 +0000 DEBUG ipatests.pytest_ipa.integration.host.Host.client0.cmd17:transport.py:558 Modify: 2020-03-03 00:22:32.659702132 +0000 DEBUG ipatests.pytest_ipa.integration.host.Host.client0.cmd17:transport.py:558 Change: 2020-03-03 00:22:32.659702132 +0000 DEBUG ipatests.pytest_ipa.integration.host.Host.client0.cmd17:transport.py:558 Birth: 2020-03-03 00:22:32.645701947 +0000 DEBUG ipatests.pytest_ipa.integration.host.Host.client0.cmd17:transport.py:217 Exit code: 0 INFO ipatests.pytest_ipa.integration.host.Host.client0.ParamikoTransport:transport.py:318 RUN ['su', '-l', 'user2', '-c', 'stat .'] DEBUG ipatests.pytest_ipa.integration.host.Host.client0.cmd18:transport.py:513 RUN ['su', '-l', 'user2', '-c', 'stat .'] DEBUG ipatests.pytest_ipa.integration.host.Host.client0.cmd18:transport.py:558 File: . DEBUG ipatests.pytest_ipa.integration.host.Host.client0.cmd18:transport.py:558 Size: 4096 Blocks: 8 IO Block: 4096 directory DEBUG ipatests.pytest_ipa.integration.host.Host.client0.cmd18:transport.py:558 Device: fc01h/64513d Inode: 524310 Links: 3 DEBUG ipatests.pytest_ipa.integration.host.Host.client0.cmd18:transport.py:558 Access: (0700/drwx------) Uid: (1877600005/ user2) Gid: (1877600005/ user2) DEBUG ipatests.pytest_ipa.integration.host.Host.client0.cmd18:transport.py:558 Context: unconfined_u:object_r:user_home_dir_t:s0 DEBUG ipatests.pytest_ipa.integration.host.Host.client0.cmd18:transport.py:558 Access: 2020-03-03 00:22:33.946719128 +0000 DEBUG ipatests.pytest_ipa.integration.host.Host.client0.cmd18:transport.py:558 Modify: 2020-03-03 00:22:33.947719141 +0000 DEBUG ipatests.pytest_ipa.integration.host.Host.client0.cmd18:transport.py:558 Change: 2020-03-03 00:22:33.947719141 +0000 DEBUG ipatests.pytest_ipa.integration.host.Host.client0.cmd18:transport.py:558 Birth: 2020-03-03 00:22:33.946719128 +0000 DEBUG ipatests.pytest_ipa.integration.host.Host.client0.cmd18:transport.py:217 Exit code: 0 INFO ipatests.pytest_ipa.integration.host.Host.client0.ParamikoTransport:transport.py:318 RUN ['su', '-l', 'testuser@ad.test', '-c', 'stat .'] DEBUG ipatests.pytest_ipa.integration.host.Host.client0.cmd19:transport.py:513 RUN ['su', '-l', 'testuser@ad.test', '-c', 'stat .'] DEBUG ipatests.pytest_ipa.integration.host.Host.client0.cmd19:transport.py:558 File: . DEBUG ipatests.pytest_ipa.integration.host.Host.client0.cmd19:transport.py:558 Size: 4096 Blocks: 8 IO Block: 4096 directory DEBUG ipatests.pytest_ipa.integration.host.Host.client0.cmd19:transport.py:558 Device: fc01h/64513d Inode: 524318 Links: 3 DEBUG ipatests.pytest_ipa.integration.host.Host.client0.cmd19:transport.py:558 Access: (0700/drwx------) Uid: (905801106/testuser@ad.test) Gid: (905801106/testuser@ad.test) DEBUG ipatests.pytest_ipa.integration.host.Host.client0.cmd19:transport.py:558 Context: unconfined_u:object_r:user_home_t:s0 DEBUG ipatests.pytest_ipa.integration.host.Host.client0.cmd19:transport.py:558 Access: 2020-03-03 00:22:35.297736970 +0000 DEBUG ipatests.pytest_ipa.integration.host.Host.client0.cmd19:transport.py:558 Modify: 2020-03-03 00:22:35.298736983 +0000 DEBUG ipatests.pytest_ipa.integration.host.Host.client0.cmd19:transport.py:558 Change: 2020-03-03 00:22:35.298736983 +0000 DEBUG ipatests.pytest_ipa.integration.host.Host.client0.cmd19:transport.py:558 Birth: 2020-03-03 00:22:35.297736970 +0000 DEBUG ipatests.pytest_ipa.integration.host.Host.client0.cmd19:transport.py:217 Exit code: 0
-------------------------------Captured log call--------------------------------
INFO ipatests.pytest_ipa.integration.host.Host.client0.ParamikoTransport:transport.py:318 RUN ['ipa-client-samba', '--uninstall', '-U'] DEBUG ipatests.pytest_ipa.integration.host.Host.client0.cmd20:transport.py:513 RUN ['ipa-client-samba', '--uninstall', '-U'] DEBUG ipatests.pytest_ipa.integration.host.Host.client0.cmd20:transport.py:558 Samba domain member is not configured yet DEBUG ipatests.pytest_ipa.integration.host.Host.client0.cmd20:transport.py:217 Exit code: 0
Passed test_integration/test_smb.py::TestSMB::test_install_samba 17.77
-------------------------------Captured log call--------------------------------
INFO ipatests.pytest_ipa.integration.host.Host.client0.ParamikoTransport:transport.py:318 RUN ['ipa-client-samba', '-U'] DEBUG ipatests.pytest_ipa.integration.host.Host.client0.cmd25:transport.py:513 RUN ['ipa-client-samba', '-U'] DEBUG ipatests.pytest_ipa.integration.host.Host.client0.cmd25:transport.py:558 Searching for IPA server... DEBUG ipatests.pytest_ipa.integration.host.Host.client0.cmd25:transport.py:558 IPA server: ['master.ipa.test'] DEBUG ipatests.pytest_ipa.integration.host.Host.client0.cmd25:transport.py:558 Chosen IPA master: ['master.ipa.test'] DEBUG ipatests.pytest_ipa.integration.host.Host.client0.cmd25:transport.py:558 SMB principal to be created: cifs/client0.ipa.test@IPA.TEST DEBUG ipatests.pytest_ipa.integration.host.Host.client0.cmd25:transport.py:558 NetBIOS name to be used: CLIENT0 DEBUG ipatests.pytest_ipa.integration.host.Host.client0.cmd25:transport.py:558 Discovered domains to use: DEBUG ipatests.pytest_ipa.integration.host.Host.client0.cmd25:transport.py:558 DEBUG ipatests.pytest_ipa.integration.host.Host.client0.cmd25:transport.py:558 Domain name: ipa.test DEBUG ipatests.pytest_ipa.integration.host.Host.client0.cmd25:transport.py:558 NetBIOS name: IPA DEBUG ipatests.pytest_ipa.integration.host.Host.client0.cmd25:transport.py:558 SID: S-1-5-21-1790674050-2471447446-686645324 DEBUG ipatests.pytest_ipa.integration.host.Host.client0.cmd25:transport.py:558 ID range: 1877600000 - 1877799999 DEBUG ipatests.pytest_ipa.integration.host.Host.client0.cmd25:transport.py:558 DEBUG ipatests.pytest_ipa.integration.host.Host.client0.cmd25:transport.py:558 DEBUG ipatests.pytest_ipa.integration.host.Host.client0.cmd25:transport.py:558 Domain name: ad.test DEBUG ipatests.pytest_ipa.integration.host.Host.client0.cmd25:transport.py:558 NetBIOS name: AD DEBUG ipatests.pytest_ipa.integration.host.Host.client0.cmd25:transport.py:558 SID: S-1-5-21-3540055105-4186384300-3258504578 DEBUG ipatests.pytest_ipa.integration.host.Host.client0.cmd25:transport.py:558 ID range: 905800000 - 905999999 DEBUG ipatests.pytest_ipa.integration.host.Host.client0.cmd25:transport.py:558 DEBUG ipatests.pytest_ipa.integration.host.Host.client0.cmd25:transport.py:558 Samba domain member is configured. Please check configuration at /etc/samba/smb.conf and start smb and winbind services DEBUG ipatests.pytest_ipa.integration.host.Host.client0.cmd25:transport.py:217 Exit code: 0 INFO ipatests.pytest_ipa.integration.host.Host.client0.ParamikoTransport:transport.py:318 RUN ['systemctl', 'status', 'smb'] DEBUG ipatests.pytest_ipa.integration.host.Host.client0.cmd26:transport.py:513 RUN ['systemctl', 'status', 'smb'] DEBUG ipatests.pytest_ipa.integration.host.Host.client0.cmd26:transport.py:558 ● smb.service - Samba SMB Daemon DEBUG ipatests.pytest_ipa.integration.host.Host.client0.cmd26:transport.py:558 Loaded: loaded (/usr/lib/systemd/system/smb.service; disabled; vendor preset: disabled) DEBUG ipatests.pytest_ipa.integration.host.Host.client0.cmd26:transport.py:558 Active: inactive (dead) DEBUG ipatests.pytest_ipa.integration.host.Host.client0.cmd26:transport.py:558 Docs: man:smbd(8) DEBUG ipatests.pytest_ipa.integration.host.Host.client0.cmd26:transport.py:558 man:samba(7) DEBUG ipatests.pytest_ipa.integration.host.Host.client0.cmd26:transport.py:558 man:smb.conf(5) DEBUG ipatests.pytest_ipa.integration.host.Host.client0.cmd26:transport.py:217 Exit code: 3 INFO ipatests.pytest_ipa.integration.host.Host.client0.ParamikoTransport:transport.py:318 RUN ['systemctl', 'status', 'winbind'] DEBUG ipatests.pytest_ipa.integration.host.Host.client0.cmd27:transport.py:513 RUN ['systemctl', 'status', 'winbind'] DEBUG ipatests.pytest_ipa.integration.host.Host.client0.cmd27:transport.py:558 ● winbind.service - Samba Winbind Daemon DEBUG ipatests.pytest_ipa.integration.host.Host.client0.cmd27:transport.py:558 Loaded: loaded (/usr/lib/systemd/system/winbind.service; disabled; vendor preset: disabled) DEBUG ipatests.pytest_ipa.integration.host.Host.client0.cmd27:transport.py:558 Active: inactive (dead) DEBUG ipatests.pytest_ipa.integration.host.Host.client0.cmd27:transport.py:558 Docs: man:winbindd(8) DEBUG ipatests.pytest_ipa.integration.host.Host.client0.cmd27:transport.py:558 man:samba(7) DEBUG ipatests.pytest_ipa.integration.host.Host.client0.cmd27:transport.py:558 man:smb.conf(5) DEBUG ipatests.pytest_ipa.integration.host.Host.client0.cmd27:transport.py:217 Exit code: 3 INFO ipatests.pytest_ipa.integration.host.Host.client0.ParamikoTransport:transport.py:318 RUN ['systemctl', 'enable', '--now', 'smb', 'winbind'] DEBUG ipatests.pytest_ipa.integration.host.Host.client0.cmd28:transport.py:513 RUN ['systemctl', 'enable', '--now', 'smb', 'winbind'] DEBUG ipatests.pytest_ipa.integration.host.Host.client0.cmd28:transport.py:558 Created symlink /etc/systemd/system/multi-user.target.wants/smb.service → /usr/lib/systemd/system/smb.service. DEBUG ipatests.pytest_ipa.integration.host.Host.client0.cmd28:transport.py:558 Created symlink /etc/systemd/system/multi-user.target.wants/winbind.service → /usr/lib/systemd/system/winbind.service. DEBUG ipatests.pytest_ipa.integration.host.Host.client0.cmd28:transport.py:217 Exit code: 0 INFO ipatests.pytest_ipa.integration.host.Host.client0.ParamikoTransport:transport.py:318 RUN ['smbcontrol', 'smbd', 'ping'] DEBUG ipatests.pytest_ipa.integration.host.Host.client0.cmd29:transport.py:513 RUN ['smbcontrol', 'smbd', 'ping'] DEBUG ipatests.pytest_ipa.integration.host.Host.client0.cmd29:transport.py:558 PONG from pid 19010 DEBUG ipatests.pytest_ipa.integration.host.Host.client0.cmd29:transport.py:217 Exit code: 0 INFO ipatests.pytest_ipa.integration.host.Host.client0.ParamikoTransport:transport.py:318 RUN ['systemctl', 'status', 'smb'] DEBUG ipatests.pytest_ipa.integration.host.Host.client0.cmd30:transport.py:513 RUN ['systemctl', 'status', 'smb'] DEBUG ipatests.pytest_ipa.integration.host.Host.client0.cmd30:transport.py:558 ● smb.service - Samba SMB Daemon DEBUG ipatests.pytest_ipa.integration.host.Host.client0.cmd30:transport.py:558 Loaded: loaded (/usr/lib/systemd/system/smb.service; enabled; vendor preset: disabled) DEBUG ipatests.pytest_ipa.integration.host.Host.client0.cmd30:transport.py:558 Active: active (running) since Tue 2020-03-03 00:22:57 UTC; 2s ago DEBUG ipatests.pytest_ipa.integration.host.Host.client0.cmd30:transport.py:558 Docs: man:smbd(8) DEBUG ipatests.pytest_ipa.integration.host.Host.client0.cmd30:transport.py:558 man:samba(7) DEBUG ipatests.pytest_ipa.integration.host.Host.client0.cmd30:transport.py:558 man:smb.conf(5) DEBUG ipatests.pytest_ipa.integration.host.Host.client0.cmd30:transport.py:558 Main PID: 19010 (smbd) DEBUG ipatests.pytest_ipa.integration.host.Host.client0.cmd30:transport.py:558 Status: "smbd: ready to serve connections..." DEBUG ipatests.pytest_ipa.integration.host.Host.client0.cmd30:transport.py:558 Tasks: 4 (limit: 1396) DEBUG ipatests.pytest_ipa.integration.host.Host.client0.cmd30:transport.py:558 Memory: 9.5M DEBUG ipatests.pytest_ipa.integration.host.Host.client0.cmd30:transport.py:558 CPU: 112ms DEBUG ipatests.pytest_ipa.integration.host.Host.client0.cmd30:transport.py:558 CGroup: /system.slice/smb.service DEBUG ipatests.pytest_ipa.integration.host.Host.client0.cmd30:transport.py:558 ├─19010 /usr/sbin/smbd --foreground --no-process-group DEBUG ipatests.pytest_ipa.integration.host.Host.client0.cmd30:transport.py:558 ├─19013 /usr/sbin/smbd --foreground --no-process-group DEBUG ipatests.pytest_ipa.integration.host.Host.client0.cmd30:transport.py:558 ├─19014 /usr/sbin/smbd --foreground --no-process-group DEBUG ipatests.pytest_ipa.integration.host.Host.client0.cmd30:transport.py:558 └─19036 /usr/sbin/smbd --foreground --no-process-group DEBUG ipatests.pytest_ipa.integration.host.Host.client0.cmd30:transport.py:558 DEBUG ipatests.pytest_ipa.integration.host.Host.client0.cmd30:transport.py:558 Mar 03 00:22:54 client0.ipa.test systemd[1]: Starting Samba SMB Daemon... DEBUG ipatests.pytest_ipa.integration.host.Host.client0.cmd30:transport.py:558 Mar 03 00:22:57 client0.ipa.test systemd[1]: Started Samba SMB Daemon. DEBUG ipatests.pytest_ipa.integration.host.Host.client0.cmd30:transport.py:558 Mar 03 00:22:57 client0.ipa.test smbd[19010]: [2020/03/03 00:22:57.751684, 0] ../../lib/util/become_daemon.c:135(daemon_ready) DEBUG ipatests.pytest_ipa.integration.host.Host.client0.cmd30:transport.py:558 Mar 03 00:22:57 client0.ipa.test smbd[19010]: daemon_ready: daemon 'smbd' finished starting up and ready to serve connections DEBUG ipatests.pytest_ipa.integration.host.Host.client0.cmd30:transport.py:558 Mar 03 00:22:59 client0.ipa.test smbd[19010]: [2020/03/03 00:22:59.764257, 0] ../../source3/printing/nt_printing.c:249(nt_printing_init) DEBUG ipatests.pytest_ipa.integration.host.Host.client0.cmd30:transport.py:558 Mar 03 00:22:59 client0.ipa.test smbd[19010]: nt_printing_init: error checking published printers: WERR_ACCESS_DENIED DEBUG ipatests.pytest_ipa.integration.host.Host.client0.cmd30:transport.py:217 Exit code: 0 INFO ipatests.pytest_ipa.integration.host.Host.client0.ParamikoTransport:transport.py:318 RUN ['systemctl', 'status', 'winbind'] DEBUG ipatests.pytest_ipa.integration.host.Host.client0.cmd31:transport.py:513 RUN ['systemctl', 'status', 'winbind'] DEBUG ipatests.pytest_ipa.integration.host.Host.client0.cmd31:transport.py:558 ● winbind.service - Samba Winbind Daemon DEBUG ipatests.pytest_ipa.integration.host.Host.client0.cmd31:transport.py:558 Loaded: loaded (/usr/lib/systemd/system/winbind.service; enabled; vendor preset: disabled) DEBUG ipatests.pytest_ipa.integration.host.Host.client0.cmd31:transport.py:558 Active: active (running) since Tue 2020-03-03 00:22:54 UTC; 5s ago DEBUG ipatests.pytest_ipa.integration.host.Host.client0.cmd31:transport.py:558 Docs: man:winbindd(8) DEBUG ipatests.pytest_ipa.integration.host.Host.client0.cmd31:transport.py:558 man:samba(7) DEBUG ipatests.pytest_ipa.integration.host.Host.client0.cmd31:transport.py:558 man:smb.conf(5) DEBUG ipatests.pytest_ipa.integration.host.Host.client0.cmd31:transport.py:558 Main PID: 19008 (winbindd) DEBUG ipatests.pytest_ipa.integration.host.Host.client0.cmd31:transport.py:558 Status: "winbindd: ready to serve connections..." DEBUG ipatests.pytest_ipa.integration.host.Host.client0.cmd31:transport.py:558 Tasks: 6 (limit: 1396) DEBUG ipatests.pytest_ipa.integration.host.Host.client0.cmd31:transport.py:558 Memory: 9.2M DEBUG ipatests.pytest_ipa.integration.host.Host.client0.cmd31:transport.py:558 CPU: 112ms DEBUG ipatests.pytest_ipa.integration.host.Host.client0.cmd31:transport.py:558 CGroup: /system.slice/winbind.service DEBUG ipatests.pytest_ipa.integration.host.Host.client0.cmd31:transport.py:558 ├─19008 /usr/sbin/winbindd --foreground --no-process-group DEBUG ipatests.pytest_ipa.integration.host.Host.client0.cmd31:transport.py:558 ├─19011 /usr/sbin/winbindd --foreground --no-process-group DEBUG ipatests.pytest_ipa.integration.host.Host.client0.cmd31:transport.py:558 ├─19015 /usr/sbin/winbindd --foreground --no-process-group DEBUG ipatests.pytest_ipa.integration.host.Host.client0.cmd31:transport.py:558 ├─19017 /usr/sbin/winbindd --foreground --no-process-group DEBUG ipatests.pytest_ipa.integration.host.Host.client0.cmd31:transport.py:558 ├─19018 /usr/sbin/winbindd --foreground --no-process-group DEBUG ipatests.pytest_ipa.integration.host.Host.client0.cmd31:transport.py:558 └─19035 /usr/sbin/winbindd --foreground --no-process-group DEBUG ipatests.pytest_ipa.integration.host.Host.client0.cmd31:transport.py:558 DEBUG ipatests.pytest_ipa.integration.host.Host.client0.cmd31:transport.py:558 Mar 03 00:22:54 client0.ipa.test systemd[1]: Starting Samba Winbind Daemon... DEBUG ipatests.pytest_ipa.integration.host.Host.client0.cmd31:transport.py:558 Mar 03 00:22:54 client0.ipa.test winbindd[19008]: [2020/03/03 00:22:54.607960, 0] ../../source3/winbindd/winbindd_cache.c:3164(initialize_winbindd_cache) DEBUG ipatests.pytest_ipa.integration.host.Host.client0.cmd31:transport.py:558 Mar 03 00:22:54 client0.ipa.test winbindd[19008]: initialize_winbindd_cache: clearing cache and re-creating with version number 2 DEBUG ipatests.pytest_ipa.integration.host.Host.client0.cmd31:transport.py:558 Mar 03 00:22:54 client0.ipa.test systemd[1]: Started Samba Winbind Daemon. DEBUG ipatests.pytest_ipa.integration.host.Host.client0.cmd31:transport.py:558 Mar 03 00:22:54 client0.ipa.test winbindd[19008]: [2020/03/03 00:22:54.622398, 0] ../../lib/util/become_daemon.c:135(daemon_ready) DEBUG ipatests.pytest_ipa.integration.host.Host.client0.cmd31:transport.py:558 Mar 03 00:22:54 client0.ipa.test winbindd[19008]: daemon_ready: daemon 'winbindd' finished starting up and ready to serve connections DEBUG ipatests.pytest_ipa.integration.host.Host.client0.cmd31:transport.py:217 Exit code: 0 INFO ipatests.pytest_ipa.integration.host.Host.client0.ParamikoTransport:transport.py:318 RUN ['smbstatus'] DEBUG ipatests.pytest_ipa.integration.host.Host.client0.cmd32:transport.py:513 RUN ['smbstatus'] DEBUG ipatests.pytest_ipa.integration.host.Host.client0.cmd32:transport.py:558 DEBUG ipatests.pytest_ipa.integration.host.Host.client0.cmd32:transport.py:558 Samba version 4.11.6 DEBUG ipatests.pytest_ipa.integration.host.Host.client0.cmd32:transport.py:558 PID Username Group Machine Protocol Version Encryption Signing DEBUG ipatests.pytest_ipa.integration.host.Host.client0.cmd32:transport.py:558 ---------------------------------------------------------------------------------------------------------------------------------------- DEBUG ipatests.pytest_ipa.integration.host.Host.client0.cmd32:transport.py:558 DEBUG ipatests.pytest_ipa.integration.host.Host.client0.cmd32:transport.py:558 Service pid Machine Connected at Encryption Signing DEBUG ipatests.pytest_ipa.integration.host.Host.client0.cmd32:transport.py:558 --------------------------------------------------------------------------------------------- DEBUG ipatests.pytest_ipa.integration.host.Host.client0.cmd32:transport.py:558 DEBUG ipatests.pytest_ipa.integration.host.Host.client0.cmd32:transport.py:558 No locked files DEBUG ipatests.pytest_ipa.integration.host.Host.client0.cmd32:transport.py:558 DEBUG ipatests.pytest_ipa.integration.host.Host.client0.cmd32:transport.py:217 Exit code: 0
Passed test_integration/test_smb.py::TestSMB::test_samba_service_listed 2.20
-------------------------------Captured log call--------------------------------
INFO ipatests.pytest_ipa.integration.host.Host.master.ParamikoTransport:transport.py:318 RUN ['kinit', 'admin'] DEBUG ipatests.pytest_ipa.integration.host.Host.master.cmd82:transport.py:513 RUN ['kinit', 'admin'] DEBUG ipatests.pytest_ipa.integration.host.Host.master.cmd82:transport.py:558 Password for admin@IPA.TEST: DEBUG ipatests.pytest_ipa.integration.host.Host.master.cmd82:transport.py:217 Exit code: 0 INFO ipatests.pytest_ipa.integration.host.Host.master.ParamikoTransport:transport.py:318 RUN ['ipa', 'service-show', '--raw', 'cifs/client0.ipa.test@IPA.TEST'] DEBUG ipatests.pytest_ipa.integration.host.Host.master.cmd83:transport.py:513 RUN ['ipa', 'service-show', '--raw', 'cifs/client0.ipa.test@IPA.TEST'] DEBUG ipatests.pytest_ipa.integration.host.Host.master.cmd83:transport.py:558 krbcanonicalname: cifs/client0.ipa.test@IPA.TEST DEBUG ipatests.pytest_ipa.integration.host.Host.master.cmd83:transport.py:558 krbprincipalname: cifs/client0.ipa.test@IPA.TEST DEBUG ipatests.pytest_ipa.integration.host.Host.master.cmd83:transport.py:558 krbprincipalname: CLIENT0$@IPA.TEST DEBUG ipatests.pytest_ipa.integration.host.Host.master.cmd83:transport.py:558 has_keytab: TRUE DEBUG ipatests.pytest_ipa.integration.host.Host.master.cmd83:transport.py:558 managedby: fqdn=client0.ipa.test,cn=computers,cn=accounts,dc=ipa,dc=test DEBUG ipatests.pytest_ipa.integration.host.Host.master.cmd83:transport.py:217 Exit code: 0 INFO ipatests.pytest_ipa.integration.host.Host.master.ParamikoTransport:transport.py:318 RUN ['ipa', 'service-find', '--raw', 'cifs/client0.ipa.test@IPA.TEST'] DEBUG ipatests.pytest_ipa.integration.host.Host.master.cmd84:transport.py:513 RUN ['ipa', 'service-find', '--raw', 'cifs/client0.ipa.test@IPA.TEST'] DEBUG ipatests.pytest_ipa.integration.host.Host.master.cmd84:transport.py:558 ----------------- DEBUG ipatests.pytest_ipa.integration.host.Host.master.cmd84:transport.py:558 1 service matched DEBUG ipatests.pytest_ipa.integration.host.Host.master.cmd84:transport.py:558 ----------------- DEBUG ipatests.pytest_ipa.integration.host.Host.master.cmd84:transport.py:558 krbcanonicalname: cifs/client0.ipa.test@IPA.TEST DEBUG ipatests.pytest_ipa.integration.host.Host.master.cmd84:transport.py:558 krbprincipalname: cifs/client0.ipa.test@IPA.TEST DEBUG ipatests.pytest_ipa.integration.host.Host.master.cmd84:transport.py:558 krbprincipalname: CLIENT0$@IPA.TEST DEBUG ipatests.pytest_ipa.integration.host.Host.master.cmd84:transport.py:558 has_keytab: TRUE DEBUG ipatests.pytest_ipa.integration.host.Host.master.cmd84:transport.py:558 ---------------------------- DEBUG ipatests.pytest_ipa.integration.host.Host.master.cmd84:transport.py:558 Number of entries returned 1 DEBUG ipatests.pytest_ipa.integration.host.Host.master.cmd84:transport.py:558 ---------------------------- DEBUG ipatests.pytest_ipa.integration.host.Host.master.cmd84:transport.py:217 Exit code: 0
Passed test_integration/test_smb.py::TestSMB::test_smb_access_for_ipa_user_at_ipa_client 3.97
-------------------------------Captured log call--------------------------------
INFO ipatests.pytest_ipa.integration.host.Host.client1.ParamikoTransport:transport.py:318 RUN ['kdestroy', '-A'] DEBUG ipatests.pytest_ipa.integration.host.Host.client1.cmd29:transport.py:513 RUN ['kdestroy', '-A'] DEBUG ipatests.pytest_ipa.integration.host.Host.client1.cmd29:transport.py:217 Exit code: 0 INFO ipatests.pytest_ipa.integration.host.Host.client1.ParamikoTransport:transport.py:318 RUN ['kinit', 'user1'] DEBUG ipatests.pytest_ipa.integration.host.Host.client1.cmd30:transport.py:513 RUN ['kinit', 'user1'] DEBUG ipatests.pytest_ipa.integration.host.Host.client1.cmd30:transport.py:558 Password for user1@IPA.TEST: DEBUG ipatests.pytest_ipa.integration.host.Host.client1.cmd30:transport.py:217 Exit code: 0 INFO ipatests.pytest_ipa.integration.host.Host.client1.ParamikoTransport:transport.py:318 RUN ['mkdir', '-p', '/mnt/smb'] DEBUG ipatests.pytest_ipa.integration.host.Host.client1.cmd31:transport.py:513 RUN ['mkdir', '-p', '/mnt/smb'] DEBUG ipatests.pytest_ipa.integration.host.Host.client1.cmd31:transport.py:217 Exit code: 0 INFO ipatests.pytest_ipa.integration.host.Host.client1.ParamikoTransport:transport.py:318 RUN ['mount', '-t', 'cifs', '//client0.ipa.test/homes', '/mnt/smb', '-o', 'sec=krb5i,multiuser'] DEBUG ipatests.pytest_ipa.integration.host.Host.client1.cmd32:transport.py:513 RUN ['mount', '-t', 'cifs', '//client0.ipa.test/homes', '/mnt/smb', '-o', 'sec=krb5i,multiuser'] DEBUG ipatests.pytest_ipa.integration.host.Host.client1.cmd32:transport.py:217 Exit code: 0 INFO ipatests.pytest_ipa.integration.host.Host.client1.ParamikoTransport:transport.py:318 RUN ['kdestroy', '-A'] DEBUG ipatests.pytest_ipa.integration.host.Host.client1.cmd33:transport.py:513 RUN ['kdestroy', '-A'] DEBUG ipatests.pytest_ipa.integration.host.Host.client1.cmd33:transport.py:217 Exit code: 0 INFO ipatests.pytest_ipa.integration.host.Host.client1.ParamikoTransport:transport.py:318 RUN ['su', '-l', 'user1', '-c', 'kdestroy -A'] DEBUG ipatests.pytest_ipa.integration.host.Host.client1.cmd34:transport.py:513 RUN ['su', '-l', 'user1', '-c', 'kdestroy -A'] DEBUG ipatests.pytest_ipa.integration.host.Host.client1.cmd34:transport.py:217 Exit code: 0 INFO ipatests.pytest_ipa.integration.host.Host.client1.ParamikoTransport:transport.py:318 RUN ['su', '-l', 'user1', '-c', 'kinit user1'] DEBUG ipatests.pytest_ipa.integration.host.Host.client1.cmd35:transport.py:513 RUN ['su', '-l', 'user1', '-c', 'kinit user1'] DEBUG ipatests.pytest_ipa.integration.host.Host.client1.cmd35:transport.py:558 Password for user1@IPA.TEST: DEBUG ipatests.pytest_ipa.integration.host.Host.client1.cmd35:transport.py:217 Exit code: 0 INFO ipatests.pytest_ipa.integration.host.Host.client1.ParamikoTransport:transport.py:318 RUN ['su', '-l', 'user1', '-c', 'cd /mnt/smb; mkdir testdir_user1'] DEBUG ipatests.pytest_ipa.integration.host.Host.client1.cmd36:transport.py:513 RUN ['su', '-l', 'user1', '-c', 'cd /mnt/smb; mkdir testdir_user1'] DEBUG ipatests.pytest_ipa.integration.host.Host.client1.cmd36:transport.py:217 Exit code: 0 INFO ipatests.pytest_ipa.integration.host.Host.client1.ParamikoTransport:transport.py:318 RUN ['su', '-l', 'user1', '-c', "cd /mnt/smb; stat -c '%n %U %G' testdir_user1"] DEBUG ipatests.pytest_ipa.integration.host.Host.client1.cmd37:transport.py:513 RUN ['su', '-l', 'user1', '-c', "cd /mnt/smb; stat -c '%n %U %G' testdir_user1"] DEBUG ipatests.pytest_ipa.integration.host.Host.client1.cmd37:transport.py:558 testdir_user1 user1 user1 DEBUG ipatests.pytest_ipa.integration.host.Host.client1.cmd37:transport.py:217 Exit code: 0 INFO ipatests.pytest_ipa.integration.host.Host.client0.ParamikoTransport:transport.py:318 RUN ['stat', '-c', '%n %U %G', 'testdir_user1'] DEBUG ipatests.pytest_ipa.integration.host.Host.client0.cmd41:transport.py:513 RUN ['stat', '-c', '%n %U %G', 'testdir_user1'] DEBUG ipatests.pytest_ipa.integration.host.Host.client0.cmd41:transport.py:558 testdir_user1 user1 user1 DEBUG ipatests.pytest_ipa.integration.host.Host.client0.cmd41:transport.py:217 Exit code: 0 INFO ipatests.pytest_ipa.integration.host.Host.client1.ParamikoTransport:transport.py:318 RUN ['su', '-l', 'user1', '-c', 'cd /mnt/smb; printf "Hello, world!" > testdir_user1/testfile_user1'] DEBUG ipatests.pytest_ipa.integration.host.Host.client1.cmd38:transport.py:513 RUN ['su', '-l', 'user1', '-c', 'cd /mnt/smb; printf "Hello, world!" > testdir_user1/testfile_user1'] DEBUG ipatests.pytest_ipa.integration.host.Host.client1.cmd38:transport.py:217 Exit code: 0 INFO ipatests.pytest_ipa.integration.host.Host.client1.ParamikoTransport:transport.py:318 RUN ['su', '-l', 'user1', '-c', 'cd /mnt/smb; ls testdir_user1'] DEBUG ipatests.pytest_ipa.integration.host.Host.client1.cmd39:transport.py:513 RUN ['su', '-l', 'user1', '-c', 'cd /mnt/smb; ls testdir_user1'] DEBUG ipatests.pytest_ipa.integration.host.Host.client1.cmd39:transport.py:558 testfile_user1 DEBUG ipatests.pytest_ipa.integration.host.Host.client1.cmd39:transport.py:217 Exit code: 0 INFO ipatests.pytest_ipa.integration.host.Host.client0.ParamikoTransport:transport.py:318 RUN ['ls', 'testdir_user1'] DEBUG ipatests.pytest_ipa.integration.host.Host.client0.cmd42:transport.py:513 RUN ['ls', 'testdir_user1'] DEBUG ipatests.pytest_ipa.integration.host.Host.client0.cmd42:transport.py:558 testfile_user1 DEBUG ipatests.pytest_ipa.integration.host.Host.client0.cmd42:transport.py:217 Exit code: 0 INFO ipatests.pytest_ipa.integration.host.Host.client0.ParamikoTransport:transport.py:318 RUN ['stat', '-c', '%n %s %U %G', 'testdir_user1/testfile_user1'] DEBUG ipatests.pytest_ipa.integration.host.Host.client0.cmd43:transport.py:513 RUN ['stat', '-c', '%n %s %U %G', 'testdir_user1/testfile_user1'] DEBUG ipatests.pytest_ipa.integration.host.Host.client0.cmd43:transport.py:558 testdir_user1/testfile_user1 13 user1 user1 DEBUG ipatests.pytest_ipa.integration.host.Host.client0.cmd43:transport.py:217 Exit code: 0 INFO ipatests.pytest_ipa.integration.host.Host.client1.ParamikoTransport:transport.py:318 RUN ['su', '-l', 'user1', '-c', "cd /mnt/smb; stat -c '%n %s %U %G' testdir_user1/testfile_user1"] DEBUG ipatests.pytest_ipa.integration.host.Host.client1.cmd40:transport.py:513 RUN ['su', '-l', 'user1', '-c', "cd /mnt/smb; stat -c '%n %s %U %G' testdir_user1/testfile_user1"] DEBUG ipatests.pytest_ipa.integration.host.Host.client1.cmd40:transport.py:558 testdir_user1/testfile_user1 13 user1 user1 DEBUG ipatests.pytest_ipa.integration.host.Host.client1.cmd40:transport.py:217 Exit code: 0 INFO ipatests.pytest_ipa.integration.host.Host.client1.ParamikoTransport:transport.py:318 RUN ['su', '-l', 'user1', '-c', 'cd /mnt/smb; cat testdir_user1/testfile_user1'] DEBUG ipatests.pytest_ipa.integration.host.Host.client1.cmd41:transport.py:513 RUN ['su', '-l', 'user1', '-c', 'cd /mnt/smb; cat testdir_user1/testfile_user1'] DEBUG ipatests.pytest_ipa.integration.host.Host.client1.cmd41:transport.py:558 Hello, world! DEBUG ipatests.pytest_ipa.integration.host.Host.client1.cmd41:transport.py:217 Exit code: 0 DEBUG ipatests.pytest_ipa.integration.host.Host.client0.ParamikoTransport:transport.py:284 READ /home/user1/testdir_user1/testfile_user1 INFO ipatests.pytest_ipa.integration.host.Host.client1.ParamikoTransport:transport.py:318 RUN ['su', '-l', 'user1', '-c', 'cd /mnt/smb; smbclient -k //client0.ipa.test/homes -c dir'] DEBUG ipatests.pytest_ipa.integration.host.Host.client1.cmd42:transport.py:513 RUN ['su', '-l', 'user1', '-c', 'cd /mnt/smb; smbclient -k //client0.ipa.test/homes -c dir'] DEBUG ipatests.pytest_ipa.integration.host.Host.client1.cmd42:transport.py:558 . D 0 Tue Mar 3 00:23:14 2020 DEBUG ipatests.pytest_ipa.integration.host.Host.client1.cmd42:transport.py:558 .. D 0 Tue Mar 3 00:22:35 2020 DEBUG ipatests.pytest_ipa.integration.host.Host.client1.cmd42:transport.py:558 .bashrc H 376 Tue Mar 3 00:22:32 2020 DEBUG ipatests.pytest_ipa.integration.host.Host.client1.cmd42:transport.py:558 .bash_logout H 18 Tue Mar 3 00:22:32 2020 DEBUG ipatests.pytest_ipa.integration.host.Host.client1.cmd42:transport.py:558 .bash_profile H 141 Tue Mar 3 00:22:32 2020 DEBUG ipatests.pytest_ipa.integration.host.Host.client1.cmd42:transport.py:558 .mozilla DH 0 Tue Mar 3 00:22:32 2020 DEBUG ipatests.pytest_ipa.integration.host.Host.client1.cmd42:transport.py:558 testdir_user1 D 0 Tue Mar 3 00:23:14 2020 DEBUG ipatests.pytest_ipa.integration.host.Host.client1.cmd42:transport.py:558 DEBUG ipatests.pytest_ipa.integration.host.Host.client1.cmd42:transport.py:558 41021664 blocks of size 1024. 34567500 blocks available DEBUG ipatests.pytest_ipa.integration.host.Host.client1.cmd42:transport.py:217 Exit code: 0 INFO ipatests.pytest_ipa.integration.host.Host.client1.ParamikoTransport:transport.py:318 RUN ['su', '-l', 'user1', '-c', 'cd /mnt/smb; rm testdir_user1/testfile_user1'] DEBUG ipatests.pytest_ipa.integration.host.Host.client1.cmd43:transport.py:513 RUN ['su', '-l', 'user1', '-c', 'cd /mnt/smb; rm testdir_user1/testfile_user1'] DEBUG ipatests.pytest_ipa.integration.host.Host.client1.cmd43:transport.py:217 Exit code: 0 INFO ipatests.pytest_ipa.integration.host.Host.client1.ParamikoTransport:transport.py:318 RUN ['su', '-l', 'user1', '-c', 'cd /mnt/smb; rmdir testdir_user1'] DEBUG ipatests.pytest_ipa.integration.host.Host.client1.cmd44:transport.py:513 RUN ['su', '-l', 'user1', '-c', 'cd /mnt/smb; rmdir testdir_user1'] DEBUG ipatests.pytest_ipa.integration.host.Host.client1.cmd44:transport.py:217 Exit code: 0 INFO ipatests.pytest_ipa.integration.host.Host.client1.ParamikoTransport:transport.py:318 RUN ['su', '-l', 'user1', '-c', 'cd /mnt/smb; stat testdir_user1'] DEBUG ipatests.pytest_ipa.integration.host.Host.client1.cmd45:transport.py:513 RUN ['su', '-l', 'user1', '-c', 'cd /mnt/smb; stat testdir_user1'] DEBUG ipatests.pytest_ipa.integration.host.Host.client1.cmd45:transport.py:558 stat: cannot stat 'testdir_user1': No such file or directory DEBUG ipatests.pytest_ipa.integration.host.Host.client1.cmd45:transport.py:217 Exit code: 1 INFO ipatests.pytest_ipa.integration.host.Host.client0.ParamikoTransport:transport.py:318 RUN ['stat', 'testdir_user1'] DEBUG ipatests.pytest_ipa.integration.host.Host.client0.cmd44:transport.py:513 RUN ['stat', 'testdir_user1'] DEBUG ipatests.pytest_ipa.integration.host.Host.client0.cmd44:transport.py:558 stat: cannot stat 'testdir_user1': No such file or directory DEBUG ipatests.pytest_ipa.integration.host.Host.client0.cmd44:transport.py:217 Exit code: 1 INFO ipatests.pytest_ipa.integration.host.Host.client0.ParamikoTransport:transport.py:318 RUN ['rm', '-rf', 'testdir_user1'] DEBUG ipatests.pytest_ipa.integration.host.Host.client0.cmd45:transport.py:513 RUN ['rm', '-rf', 'testdir_user1'] DEBUG ipatests.pytest_ipa.integration.host.Host.client0.cmd45:transport.py:217 Exit code: 0 INFO ipatests.pytest_ipa.integration.host.Host.client1.ParamikoTransport:transport.py:318 RUN ['umount', '/mnt/smb'] DEBUG ipatests.pytest_ipa.integration.host.Host.client1.cmd46:transport.py:513 RUN ['umount', '/mnt/smb'] DEBUG ipatests.pytest_ipa.integration.host.Host.client1.cmd46:transport.py:217 Exit code: 0 INFO ipatests.pytest_ipa.integration.host.Host.client1.ParamikoTransport:transport.py:318 RUN ['rmdir', '/mnt/smb'] DEBUG ipatests.pytest_ipa.integration.host.Host.client1.cmd47:transport.py:513 RUN ['rmdir', '/mnt/smb'] DEBUG ipatests.pytest_ipa.integration.host.Host.client1.cmd47:transport.py:217 Exit code: 0
Passed test_integration/test_smb.py::TestSMB::test_smb_access_for_ad_user_at_ipa_client 3.53
-------------------------------Captured log setup-------------------------------
INFO ipatests.pytest_ipa.integration.host.Host.client1.ParamikoTransport:transport.py:318 RUN ['mktemp'] DEBUG ipatests.pytest_ipa.integration.host.Host.client1.cmd52:transport.py:513 RUN ['mktemp'] DEBUG ipatests.pytest_ipa.integration.host.Host.client1.cmd52:transport.py:558 /tmp/tmp.9PA0b8mlXw DEBUG ipatests.pytest_ipa.integration.host.Host.client1.cmd52:transport.py:217 Exit code: 0 INFO ipatests.pytest_ipa.integration.host.Host.client1.ParamikoTransport:transport.py:318 RUN ['cp', '--preserve=all', '/etc/krb5.conf', '/tmp/tmp.9PA0b8mlXw'] DEBUG ipatests.pytest_ipa.integration.host.Host.client1.cmd53:transport.py:513 RUN ['cp', '--preserve=all', '/etc/krb5.conf', '/tmp/tmp.9PA0b8mlXw'] DEBUG ipatests.pytest_ipa.integration.host.Host.client1.cmd53:transport.py:217 Exit code: 0 DEBUG ipatests.pytest_ipa.integration.host.Host.client1.ParamikoTransport:transport.py:284 READ /etc/krb5.conf INFO ipatests.pytest_ipa.integration.host.Host.client1.ParamikoTransport:transport.py:293 WRITE /etc/krb5.conf
-------------------------------Captured log call--------------------------------
INFO ipatests.pytest_ipa.integration.host.Host.client1.ParamikoTransport:transport.py:318 RUN ['kdestroy', '-A'] DEBUG ipatests.pytest_ipa.integration.host.Host.client1.cmd54:transport.py:513 RUN ['kdestroy', '-A'] DEBUG ipatests.pytest_ipa.integration.host.Host.client1.cmd54:transport.py:217 Exit code: 0 INFO ipatests.pytest_ipa.integration.host.Host.client1.ParamikoTransport:transport.py:318 RUN ['kinit', 'testuser@ad.test'] DEBUG ipatests.pytest_ipa.integration.host.Host.client1.cmd55:transport.py:513 RUN ['kinit', 'testuser@ad.test'] DEBUG ipatests.pytest_ipa.integration.host.Host.client1.cmd55:transport.py:558 Password for testuser@ad.test: DEBUG ipatests.pytest_ipa.integration.host.Host.client1.cmd55:transport.py:217 Exit code: 0 INFO ipatests.pytest_ipa.integration.host.Host.client1.ParamikoTransport:transport.py:318 RUN ['mkdir', '-p', '/mnt/smb'] DEBUG ipatests.pytest_ipa.integration.host.Host.client1.cmd56:transport.py:513 RUN ['mkdir', '-p', '/mnt/smb'] DEBUG ipatests.pytest_ipa.integration.host.Host.client1.cmd56:transport.py:217 Exit code: 0 INFO ipatests.pytest_ipa.integration.host.Host.client1.ParamikoTransport:transport.py:318 RUN ['mount', '-t', 'cifs', '//client0.ipa.test/homes', '/mnt/smb', '-o', 'sec=krb5i,multiuser'] DEBUG ipatests.pytest_ipa.integration.host.Host.client1.cmd57:transport.py:513 RUN ['mount', '-t', 'cifs', '//client0.ipa.test/homes', '/mnt/smb', '-o', 'sec=krb5i,multiuser'] DEBUG ipatests.pytest_ipa.integration.host.Host.client1.cmd57:transport.py:217 Exit code: 0 INFO ipatests.pytest_ipa.integration.host.Host.client1.ParamikoTransport:transport.py:318 RUN ['kdestroy', '-A'] DEBUG ipatests.pytest_ipa.integration.host.Host.client1.cmd58:transport.py:513 RUN ['kdestroy', '-A'] DEBUG ipatests.pytest_ipa.integration.host.Host.client1.cmd58:transport.py:217 Exit code: 0 INFO ipatests.pytest_ipa.integration.host.Host.client1.ParamikoTransport:transport.py:318 RUN ['su', '-l', 'testuser@ad.test', '-c', 'kdestroy -A'] DEBUG ipatests.pytest_ipa.integration.host.Host.client1.cmd59:transport.py:513 RUN ['su', '-l', 'testuser@ad.test', '-c', 'kdestroy -A'] DEBUG ipatests.pytest_ipa.integration.host.Host.client1.cmd59:transport.py:217 Exit code: 0 INFO ipatests.pytest_ipa.integration.host.Host.client1.ParamikoTransport:transport.py:318 RUN ['su', '-l', 'testuser@ad.test', '-c', 'kinit testuser@ad.test'] DEBUG ipatests.pytest_ipa.integration.host.Host.client1.cmd60:transport.py:513 RUN ['su', '-l', 'testuser@ad.test', '-c', 'kinit testuser@ad.test'] DEBUG ipatests.pytest_ipa.integration.host.Host.client1.cmd60:transport.py:558 Password for testuser@ad.test: DEBUG ipatests.pytest_ipa.integration.host.Host.client1.cmd60:transport.py:217 Exit code: 0 INFO ipatests.pytest_ipa.integration.host.Host.client1.ParamikoTransport:transport.py:318 RUN ['su', '-l', 'testuser@ad.test', '-c', 'cd /mnt/smb; mkdir testdir_testuser@ad.test'] DEBUG ipatests.pytest_ipa.integration.host.Host.client1.cmd61:transport.py:513 RUN ['su', '-l', 'testuser@ad.test', '-c', 'cd /mnt/smb; mkdir testdir_testuser@ad.test'] DEBUG ipatests.pytest_ipa.integration.host.Host.client1.cmd61:transport.py:217 Exit code: 0 INFO ipatests.pytest_ipa.integration.host.Host.client1.ParamikoTransport:transport.py:318 RUN ['su', '-l', 'testuser@ad.test', '-c', "cd /mnt/smb; stat -c '%n %U %G' testdir_testuser@ad.test"] DEBUG ipatests.pytest_ipa.integration.host.Host.client1.cmd62:transport.py:513 RUN ['su', '-l', 'testuser@ad.test', '-c', "cd /mnt/smb; stat -c '%n %U %G' testdir_testuser@ad.test"] DEBUG ipatests.pytest_ipa.integration.host.Host.client1.cmd62:transport.py:558 testdir_testuser@ad.test testuser@ad.test testuser@ad.test DEBUG ipatests.pytest_ipa.integration.host.Host.client1.cmd62:transport.py:217 Exit code: 0 INFO ipatests.pytest_ipa.integration.host.Host.client0.ParamikoTransport:transport.py:318 RUN ['stat', '-c', '%n %U %G', 'testdir_testuser@ad.test'] DEBUG ipatests.pytest_ipa.integration.host.Host.client0.cmd50:transport.py:513 RUN ['stat', '-c', '%n %U %G', 'testdir_testuser@ad.test'] DEBUG ipatests.pytest_ipa.integration.host.Host.client0.cmd50:transport.py:558 testdir_testuser@ad.test testuser@ad.test testuser@ad.test DEBUG ipatests.pytest_ipa.integration.host.Host.client0.cmd50:transport.py:217 Exit code: 0 INFO ipatests.pytest_ipa.integration.host.Host.client1.ParamikoTransport:transport.py:318 RUN ['su', '-l', 'testuser@ad.test', '-c', 'cd /mnt/smb; printf "Hello, world!" > testdir_testuser@ad.test/testfile_testuser@ad.test'] DEBUG ipatests.pytest_ipa.integration.host.Host.client1.cmd63:transport.py:513 RUN ['su', '-l', 'testuser@ad.test', '-c', 'cd /mnt/smb; printf "Hello, world!" > testdir_testuser@ad.test/testfile_testuser@ad.test'] DEBUG ipatests.pytest_ipa.integration.host.Host.client1.cmd63:transport.py:217 Exit code: 0 INFO ipatests.pytest_ipa.integration.host.Host.client1.ParamikoTransport:transport.py:318 RUN ['su', '-l', 'testuser@ad.test', '-c', 'cd /mnt/smb; ls testdir_testuser@ad.test'] DEBUG ipatests.pytest_ipa.integration.host.Host.client1.cmd64:transport.py:513 RUN ['su', '-l', 'testuser@ad.test', '-c', 'cd /mnt/smb; ls testdir_testuser@ad.test'] DEBUG ipatests.pytest_ipa.integration.host.Host.client1.cmd64:transport.py:558 testfile_testuser@ad.test DEBUG ipatests.pytest_ipa.integration.host.Host.client1.cmd64:transport.py:217 Exit code: 0 INFO ipatests.pytest_ipa.integration.host.Host.client0.ParamikoTransport:transport.py:318 RUN ['ls', 'testdir_testuser@ad.test'] DEBUG ipatests.pytest_ipa.integration.host.Host.client0.cmd51:transport.py:513 RUN ['ls', 'testdir_testuser@ad.test'] DEBUG ipatests.pytest_ipa.integration.host.Host.client0.cmd51:transport.py:558 testfile_testuser@ad.test DEBUG ipatests.pytest_ipa.integration.host.Host.client0.cmd51:transport.py:217 Exit code: 0 INFO ipatests.pytest_ipa.integration.host.Host.client0.ParamikoTransport:transport.py:318 RUN ['stat', '-c', '%n %s %U %G', 'testdir_testuser@ad.test/testfile_testuser@ad.test'] DEBUG ipatests.pytest_ipa.integration.host.Host.client0.cmd52:transport.py:513 RUN ['stat', '-c', '%n %s %U %G', 'testdir_testuser@ad.test/testfile_testuser@ad.test'] DEBUG ipatests.pytest_ipa.integration.host.Host.client0.cmd52:transport.py:558 testdir_testuser@ad.test/testfile_testuser@ad.test 13 testuser@ad.test testuser@ad.test DEBUG ipatests.pytest_ipa.integration.host.Host.client0.cmd52:transport.py:217 Exit code: 0 INFO ipatests.pytest_ipa.integration.host.Host.client1.ParamikoTransport:transport.py:318 RUN ['su', '-l', 'testuser@ad.test', '-c', "cd /mnt/smb; stat -c '%n %s %U %G' testdir_testuser@ad.test/testfile_testuser@ad.test"] DEBUG ipatests.pytest_ipa.integration.host.Host.client1.cmd65:transport.py:513 RUN ['su', '-l', 'testuser@ad.test', '-c', "cd /mnt/smb; stat -c '%n %s %U %G' testdir_testuser@ad.test/testfile_testuser@ad.test"] DEBUG ipatests.pytest_ipa.integration.host.Host.client1.cmd65:transport.py:558 testdir_testuser@ad.test/testfile_testuser@ad.test 13 testuser@ad.test testuser@ad.test DEBUG ipatests.pytest_ipa.integration.host.Host.client1.cmd65:transport.py:217 Exit code: 0 INFO ipatests.pytest_ipa.integration.host.Host.client1.ParamikoTransport:transport.py:318 RUN ['su', '-l', 'testuser@ad.test', '-c', 'cd /mnt/smb; cat testdir_testuser@ad.test/testfile_testuser@ad.test'] DEBUG ipatests.pytest_ipa.integration.host.Host.client1.cmd66:transport.py:513 RUN ['su', '-l', 'testuser@ad.test', '-c', 'cd /mnt/smb; cat testdir_testuser@ad.test/testfile_testuser@ad.test'] DEBUG ipatests.pytest_ipa.integration.host.Host.client1.cmd66:transport.py:558 Hello, world! DEBUG ipatests.pytest_ipa.integration.host.Host.client1.cmd66:transport.py:217 Exit code: 0 DEBUG ipatests.pytest_ipa.integration.host.Host.client0.ParamikoTransport:transport.py:284 READ /home/ad.test/testuser/testdir_testuser@ad.test/testfile_testuser@ad.test INFO ipatests.pytest_ipa.integration.host.Host.client1.ParamikoTransport:transport.py:318 RUN ['su', '-l', 'testuser@ad.test', '-c', 'cd /mnt/smb; smbclient -k //client0.ipa.test/homes -c dir'] DEBUG ipatests.pytest_ipa.integration.host.Host.client1.cmd67:transport.py:513 RUN ['su', '-l', 'testuser@ad.test', '-c', 'cd /mnt/smb; smbclient -k //client0.ipa.test/homes -c dir'] DEBUG ipatests.pytest_ipa.integration.host.Host.client1.cmd67:transport.py:558 . D 0 Tue Mar 3 00:23:22 2020 DEBUG ipatests.pytest_ipa.integration.host.Host.client1.cmd67:transport.py:558 .. D 0 Tue Mar 3 00:22:35 2020 DEBUG ipatests.pytest_ipa.integration.host.Host.client1.cmd67:transport.py:558 .bashrc H 376 Tue Mar 3 00:22:35 2020 DEBUG ipatests.pytest_ipa.integration.host.Host.client1.cmd67:transport.py:558 testdir_testuser@ad.test D 0 Tue Mar 3 00:23:22 2020 DEBUG ipatests.pytest_ipa.integration.host.Host.client1.cmd67:transport.py:558 .bash_logout H 18 Tue Mar 3 00:22:35 2020 DEBUG ipatests.pytest_ipa.integration.host.Host.client1.cmd67:transport.py:558 .bash_profile H 141 Tue Mar 3 00:22:35 2020 DEBUG ipatests.pytest_ipa.integration.host.Host.client1.cmd67:transport.py:558 .mozilla DH 0 Tue Mar 3 00:22:35 2020 DEBUG ipatests.pytest_ipa.integration.host.Host.client1.cmd67:transport.py:558 DEBUG ipatests.pytest_ipa.integration.host.Host.client1.cmd67:transport.py:558 41021664 blocks of size 1024. 34567384 blocks available DEBUG ipatests.pytest_ipa.integration.host.Host.client1.cmd67:transport.py:217 Exit code: 0 INFO ipatests.pytest_ipa.integration.host.Host.client1.ParamikoTransport:transport.py:318 RUN ['su', '-l', 'testuser@ad.test', '-c', 'cd /mnt/smb; rm testdir_testuser@ad.test/testfile_testuser@ad.test'] DEBUG ipatests.pytest_ipa.integration.host.Host.client1.cmd68:transport.py:513 RUN ['su', '-l', 'testuser@ad.test', '-c', 'cd /mnt/smb; rm testdir_testuser@ad.test/testfile_testuser@ad.test'] DEBUG ipatests.pytest_ipa.integration.host.Host.client1.cmd68:transport.py:217 Exit code: 0 INFO ipatests.pytest_ipa.integration.host.Host.client1.ParamikoTransport:transport.py:318 RUN ['su', '-l', 'testuser@ad.test', '-c', 'cd /mnt/smb; rmdir testdir_testuser@ad.test'] DEBUG ipatests.pytest_ipa.integration.host.Host.client1.cmd69:transport.py:513 RUN ['su', '-l', 'testuser@ad.test', '-c', 'cd /mnt/smb; rmdir testdir_testuser@ad.test'] DEBUG ipatests.pytest_ipa.integration.host.Host.client1.cmd69:transport.py:217 Exit code: 0 INFO ipatests.pytest_ipa.integration.host.Host.client1.ParamikoTransport:transport.py:318 RUN ['su', '-l', 'testuser@ad.test', '-c', 'cd /mnt/smb; stat testdir_testuser@ad.test'] DEBUG ipatests.pytest_ipa.integration.host.Host.client1.cmd70:transport.py:513 RUN ['su', '-l', 'testuser@ad.test', '-c', 'cd /mnt/smb; stat testdir_testuser@ad.test'] DEBUG ipatests.pytest_ipa.integration.host.Host.client1.cmd70:transport.py:558 stat: cannot stat 'testdir_testuser@ad.test': No such file or directory DEBUG ipatests.pytest_ipa.integration.host.Host.client1.cmd70:transport.py:217 Exit code: 1 INFO ipatests.pytest_ipa.integration.host.Host.client0.ParamikoTransport:transport.py:318 RUN ['stat', 'testdir_testuser@ad.test'] DEBUG ipatests.pytest_ipa.integration.host.Host.client0.cmd53:transport.py:513 RUN ['stat', 'testdir_testuser@ad.test'] DEBUG ipatests.pytest_ipa.integration.host.Host.client0.cmd53:transport.py:558 stat: cannot stat 'testdir_testuser@ad.test': No such file or directory DEBUG ipatests.pytest_ipa.integration.host.Host.client0.cmd53:transport.py:217 Exit code: 1 INFO ipatests.pytest_ipa.integration.host.Host.client0.ParamikoTransport:transport.py:318 RUN ['rm', '-rf', 'testdir_testuser@ad.test'] DEBUG ipatests.pytest_ipa.integration.host.Host.client0.cmd54:transport.py:513 RUN ['rm', '-rf', 'testdir_testuser@ad.test'] DEBUG ipatests.pytest_ipa.integration.host.Host.client0.cmd54:transport.py:217 Exit code: 0 INFO ipatests.pytest_ipa.integration.host.Host.client1.ParamikoTransport:transport.py:318 RUN ['umount', '/mnt/smb'] DEBUG ipatests.pytest_ipa.integration.host.Host.client1.cmd71:transport.py:513 RUN ['umount', '/mnt/smb'] DEBUG ipatests.pytest_ipa.integration.host.Host.client1.cmd71:transport.py:217 Exit code: 0 INFO ipatests.pytest_ipa.integration.host.Host.client1.ParamikoTransport:transport.py:318 RUN ['rmdir', '/mnt/smb'] DEBUG ipatests.pytest_ipa.integration.host.Host.client1.cmd72:transport.py:513 RUN ['rmdir', '/mnt/smb'] DEBUG ipatests.pytest_ipa.integration.host.Host.client1.cmd72:transport.py:217 Exit code: 0
Passed test_integration/test_smb.py::TestSMB::test_smb_mount_and_access_by_different_users 3.44
-------------------------------Captured log setup-------------------------------
INFO ipatests.pytest_ipa.integration.host.Host.client0.ParamikoTransport:transport.py:318 RUN ['mkdir', '/srv/samba_shared'] DEBUG ipatests.pytest_ipa.integration.host.Host.client0.cmd59:transport.py:513 RUN ['mkdir', '/srv/samba_shared'] DEBUG ipatests.pytest_ipa.integration.host.Host.client0.cmd59:transport.py:217 Exit code: 0 INFO ipatests.pytest_ipa.integration.host.Host.client0.ParamikoTransport:transport.py:318 RUN ['chmod', '777', '/srv/samba_shared'] DEBUG ipatests.pytest_ipa.integration.host.Host.client0.cmd60:transport.py:513 RUN ['chmod', '777', '/srv/samba_shared'] DEBUG ipatests.pytest_ipa.integration.host.Host.client0.cmd60:transport.py:217 Exit code: 0 INFO ipatests.pytest_ipa.integration.host.Host.client0.ParamikoTransport:transport.py:318 RUN selinuxenabled DEBUG ipatests.pytest_ipa.integration.host.Host.client0.cmd61:transport.py:513 RUN selinuxenabled DEBUG ipatests.pytest_ipa.integration.host.Host.client0.cmd61:transport.py:217 Exit code: 0 INFO ipatests.pytest_ipa.integration.host.Host.client0.ParamikoTransport:transport.py:318 RUN ['chcon', '-t', 'samba_share_t', '/srv/samba_shared'] DEBUG ipatests.pytest_ipa.integration.host.Host.client0.cmd62:transport.py:513 RUN ['chcon', '-t', 'samba_share_t', '/srv/samba_shared'] DEBUG ipatests.pytest_ipa.integration.host.Host.client0.cmd62:transport.py:217 Exit code: 0 INFO ipatests.pytest_ipa.integration.host.Host.client0.ParamikoTransport:transport.py:318 RUN ['mktemp'] DEBUG ipatests.pytest_ipa.integration.host.Host.client0.cmd63:transport.py:513 RUN ['mktemp'] DEBUG ipatests.pytest_ipa.integration.host.Host.client0.cmd63:transport.py:558 /tmp/tmp.AgNaBZeVYV DEBUG ipatests.pytest_ipa.integration.host.Host.client0.cmd63:transport.py:217 Exit code: 0 INFO ipatests.pytest_ipa.integration.host.Host.client0.ParamikoTransport:transport.py:318 RUN ['cp', '--preserve=all', '/etc/samba/smb.conf', '/tmp/tmp.AgNaBZeVYV'] DEBUG ipatests.pytest_ipa.integration.host.Host.client0.cmd64:transport.py:513 RUN ['cp', '--preserve=all', '/etc/samba/smb.conf', '/tmp/tmp.AgNaBZeVYV'] DEBUG ipatests.pytest_ipa.integration.host.Host.client0.cmd64:transport.py:217 Exit code: 0 DEBUG ipatests.pytest_ipa.integration.host.Host.client0.ParamikoTransport:transport.py:284 READ /etc/samba/smb.conf INFO ipatests.pytest_ipa.integration.host.Host.client0.ParamikoTransport:transport.py:293 WRITE /etc/samba/smb.conf INFO ipatests.pytest_ipa.integration.host.Host.client0.ParamikoTransport:transport.py:318 RUN ['systemctl', 'restart', 'smb'] DEBUG ipatests.pytest_ipa.integration.host.Host.client0.cmd65:transport.py:513 RUN ['systemctl', 'restart', 'smb'] DEBUG ipatests.pytest_ipa.integration.host.Host.client0.cmd65:transport.py:217 Exit code: 0 INFO ipatests.pytest_ipa.integration.host.Host.client0.ParamikoTransport:transport.py:318 RUN ['smbcontrol', 'smbd', 'ping'] DEBUG ipatests.pytest_ipa.integration.host.Host.client0.cmd66:transport.py:513 RUN ['smbcontrol', 'smbd', 'ping'] DEBUG ipatests.pytest_ipa.integration.host.Host.client0.cmd66:transport.py:558 PONG from pid 19632 DEBUG ipatests.pytest_ipa.integration.host.Host.client0.cmd66:transport.py:217 Exit code: 0
-------------------------------Captured log call--------------------------------
INFO ipatests.pytest_ipa.integration.host.Host.client1.ParamikoTransport:transport.py:318 RUN ['kdestroy', '-A'] DEBUG ipatests.pytest_ipa.integration.host.Host.client1.cmd78:transport.py:513 RUN ['kdestroy', '-A'] DEBUG ipatests.pytest_ipa.integration.host.Host.client1.cmd78:transport.py:217 Exit code: 0 INFO ipatests.pytest_ipa.integration.host.Host.client1.ParamikoTransport:transport.py:318 RUN ['kinit', 'user1'] DEBUG ipatests.pytest_ipa.integration.host.Host.client1.cmd79:transport.py:513 RUN ['kinit', 'user1'] DEBUG ipatests.pytest_ipa.integration.host.Host.client1.cmd79:transport.py:558 Password for user1@IPA.TEST: DEBUG ipatests.pytest_ipa.integration.host.Host.client1.cmd79:transport.py:217 Exit code: 0 INFO ipatests.pytest_ipa.integration.host.Host.client1.ParamikoTransport:transport.py:318 RUN ['mkdir', '-p', '/mnt/smb'] DEBUG ipatests.pytest_ipa.integration.host.Host.client1.cmd80:transport.py:513 RUN ['mkdir', '-p', '/mnt/smb'] DEBUG ipatests.pytest_ipa.integration.host.Host.client1.cmd80:transport.py:217 Exit code: 0 INFO ipatests.pytest_ipa.integration.host.Host.client1.ParamikoTransport:transport.py:318 RUN ['mount', '-t', 'cifs', '//client0.ipa.test/shared', '/mnt/smb', '-o', 'sec=krb5i,multiuser'] DEBUG ipatests.pytest_ipa.integration.host.Host.client1.cmd81:transport.py:513 RUN ['mount', '-t', 'cifs', '//client0.ipa.test/shared', '/mnt/smb', '-o', 'sec=krb5i,multiuser'] DEBUG ipatests.pytest_ipa.integration.host.Host.client1.cmd81:transport.py:217 Exit code: 0 INFO ipatests.pytest_ipa.integration.host.Host.client1.ParamikoTransport:transport.py:318 RUN ['kdestroy', '-A'] DEBUG ipatests.pytest_ipa.integration.host.Host.client1.cmd82:transport.py:513 RUN ['kdestroy', '-A'] DEBUG ipatests.pytest_ipa.integration.host.Host.client1.cmd82:transport.py:217 Exit code: 0 INFO ipatests.pytest_ipa.integration.host.Host.client1.ParamikoTransport:transport.py:318 RUN ['su', '-l', 'user2', '-c', 'kdestroy -A'] DEBUG ipatests.pytest_ipa.integration.host.Host.client1.cmd83:transport.py:513 RUN ['su', '-l', 'user2', '-c', 'kdestroy -A'] DEBUG ipatests.pytest_ipa.integration.host.Host.client1.cmd83:transport.py:217 Exit code: 0 INFO ipatests.pytest_ipa.integration.host.Host.client1.ParamikoTransport:transport.py:318 RUN ['su', '-l', 'user2', '-c', 'kinit user2'] DEBUG ipatests.pytest_ipa.integration.host.Host.client1.cmd84:transport.py:513 RUN ['su', '-l', 'user2', '-c', 'kinit user2'] DEBUG ipatests.pytest_ipa.integration.host.Host.client1.cmd84:transport.py:558 Password for user2@IPA.TEST: DEBUG ipatests.pytest_ipa.integration.host.Host.client1.cmd84:transport.py:217 Exit code: 0 INFO ipatests.pytest_ipa.integration.host.Host.client1.ParamikoTransport:transport.py:318 RUN ['su', '-l', 'user2', '-c', 'cd /mnt/smb; mkdir testdir_user2'] DEBUG ipatests.pytest_ipa.integration.host.Host.client1.cmd85:transport.py:513 RUN ['su', '-l', 'user2', '-c', 'cd /mnt/smb; mkdir testdir_user2'] DEBUG ipatests.pytest_ipa.integration.host.Host.client1.cmd85:transport.py:217 Exit code: 0 INFO ipatests.pytest_ipa.integration.host.Host.client1.ParamikoTransport:transport.py:318 RUN ['su', '-l', 'user2', '-c', "cd /mnt/smb; stat -c '%n %U %G' testdir_user2"] DEBUG ipatests.pytest_ipa.integration.host.Host.client1.cmd86:transport.py:513 RUN ['su', '-l', 'user2', '-c', "cd /mnt/smb; stat -c '%n %U %G' testdir_user2"] DEBUG ipatests.pytest_ipa.integration.host.Host.client1.cmd86:transport.py:558 testdir_user2 user2 user2 DEBUG ipatests.pytest_ipa.integration.host.Host.client1.cmd86:transport.py:217 Exit code: 0 INFO ipatests.pytest_ipa.integration.host.Host.client0.ParamikoTransport:transport.py:318 RUN ['stat', '-c', '%n %U %G', 'testdir_user2'] DEBUG ipatests.pytest_ipa.integration.host.Host.client0.cmd67:transport.py:513 RUN ['stat', '-c', '%n %U %G', 'testdir_user2'] DEBUG ipatests.pytest_ipa.integration.host.Host.client0.cmd67:transport.py:558 testdir_user2 user2 user2 DEBUG ipatests.pytest_ipa.integration.host.Host.client0.cmd67:transport.py:217 Exit code: 0 INFO ipatests.pytest_ipa.integration.host.Host.client1.ParamikoTransport:transport.py:318 RUN ['su', '-l', 'user2', '-c', 'cd /mnt/smb; printf "Hello, world!" > testdir_user2/testfile_user2'] DEBUG ipatests.pytest_ipa.integration.host.Host.client1.cmd87:transport.py:513 RUN ['su', '-l', 'user2', '-c', 'cd /mnt/smb; printf "Hello, world!" > testdir_user2/testfile_user2'] DEBUG ipatests.pytest_ipa.integration.host.Host.client1.cmd87:transport.py:217 Exit code: 0 INFO ipatests.pytest_ipa.integration.host.Host.client1.ParamikoTransport:transport.py:318 RUN ['su', '-l', 'user2', '-c', 'cd /mnt/smb; ls testdir_user2'] DEBUG ipatests.pytest_ipa.integration.host.Host.client1.cmd88:transport.py:513 RUN ['su', '-l', 'user2', '-c', 'cd /mnt/smb; ls testdir_user2'] DEBUG ipatests.pytest_ipa.integration.host.Host.client1.cmd88:transport.py:558 testfile_user2 DEBUG ipatests.pytest_ipa.integration.host.Host.client1.cmd88:transport.py:217 Exit code: 0 INFO ipatests.pytest_ipa.integration.host.Host.client0.ParamikoTransport:transport.py:318 RUN ['ls', 'testdir_user2'] DEBUG ipatests.pytest_ipa.integration.host.Host.client0.cmd68:transport.py:513 RUN ['ls', 'testdir_user2'] DEBUG ipatests.pytest_ipa.integration.host.Host.client0.cmd68:transport.py:558 testfile_user2 DEBUG ipatests.pytest_ipa.integration.host.Host.client0.cmd68:transport.py:217 Exit code: 0 INFO ipatests.pytest_ipa.integration.host.Host.client0.ParamikoTransport:transport.py:318 RUN ['stat', '-c', '%n %s %U %G', 'testdir_user2/testfile_user2'] DEBUG ipatests.pytest_ipa.integration.host.Host.client0.cmd69:transport.py:513 RUN ['stat', '-c', '%n %s %U %G', 'testdir_user2/testfile_user2'] DEBUG ipatests.pytest_ipa.integration.host.Host.client0.cmd69:transport.py:558 testdir_user2/testfile_user2 13 user2 user2 DEBUG ipatests.pytest_ipa.integration.host.Host.client0.cmd69:transport.py:217 Exit code: 0 INFO ipatests.pytest_ipa.integration.host.Host.client1.ParamikoTransport:transport.py:318 RUN ['su', '-l', 'user2', '-c', "cd /mnt/smb; stat -c '%n %s %U %G' testdir_user2/testfile_user2"] DEBUG ipatests.pytest_ipa.integration.host.Host.client1.cmd89:transport.py:513 RUN ['su', '-l', 'user2', '-c', "cd /mnt/smb; stat -c '%n %s %U %G' testdir_user2/testfile_user2"] DEBUG ipatests.pytest_ipa.integration.host.Host.client1.cmd89:transport.py:558 testdir_user2/testfile_user2 13 user2 user2 DEBUG ipatests.pytest_ipa.integration.host.Host.client1.cmd89:transport.py:217 Exit code: 0 INFO ipatests.pytest_ipa.integration.host.Host.client1.ParamikoTransport:transport.py:318 RUN ['su', '-l', 'user2', '-c', 'cd /mnt/smb; cat testdir_user2/testfile_user2'] DEBUG ipatests.pytest_ipa.integration.host.Host.client1.cmd90:transport.py:513 RUN ['su', '-l', 'user2', '-c', 'cd /mnt/smb; cat testdir_user2/testfile_user2'] DEBUG ipatests.pytest_ipa.integration.host.Host.client1.cmd90:transport.py:558 Hello, world! DEBUG ipatests.pytest_ipa.integration.host.Host.client1.cmd90:transport.py:217 Exit code: 0 DEBUG ipatests.pytest_ipa.integration.host.Host.client0.ParamikoTransport:transport.py:284 READ /srv/samba_shared/testdir_user2/testfile_user2 INFO ipatests.pytest_ipa.integration.host.Host.client1.ParamikoTransport:transport.py:318 RUN ['su', '-l', 'user2', '-c', 'cd /mnt/smb; smbclient -k //client0.ipa.test/shared -c dir'] DEBUG ipatests.pytest_ipa.integration.host.Host.client1.cmd91:transport.py:513 RUN ['su', '-l', 'user2', '-c', 'cd /mnt/smb; smbclient -k //client0.ipa.test/shared -c dir'] DEBUG ipatests.pytest_ipa.integration.host.Host.client1.cmd91:transport.py:558 . D 0 Tue Mar 3 00:23:33 2020 DEBUG ipatests.pytest_ipa.integration.host.Host.client1.cmd91:transport.py:558 .. D 0 Tue Mar 3 00:23:28 2020 DEBUG ipatests.pytest_ipa.integration.host.Host.client1.cmd91:transport.py:558 testdir_user2 D 0 Tue Mar 3 00:23:33 2020 DEBUG ipatests.pytest_ipa.integration.host.Host.client1.cmd91:transport.py:558 DEBUG ipatests.pytest_ipa.integration.host.Host.client1.cmd91:transport.py:558 41021664 blocks of size 1024. 34567184 blocks available DEBUG ipatests.pytest_ipa.integration.host.Host.client1.cmd91:transport.py:217 Exit code: 0 INFO ipatests.pytest_ipa.integration.host.Host.client1.ParamikoTransport:transport.py:318 RUN ['su', '-l', 'user2', '-c', 'cd /mnt/smb; rm testdir_user2/testfile_user2'] DEBUG ipatests.pytest_ipa.integration.host.Host.client1.cmd92:transport.py:513 RUN ['su', '-l', 'user2', '-c', 'cd /mnt/smb; rm testdir_user2/testfile_user2'] DEBUG ipatests.pytest_ipa.integration.host.Host.client1.cmd92:transport.py:217 Exit code: 0 INFO ipatests.pytest_ipa.integration.host.Host.client1.ParamikoTransport:transport.py:318 RUN ['su', '-l', 'user2', '-c', 'cd /mnt/smb; rmdir testdir_user2'] DEBUG ipatests.pytest_ipa.integration.host.Host.client1.cmd93:transport.py:513 RUN ['su', '-l', 'user2', '-c', 'cd /mnt/smb; rmdir testdir_user2'] DEBUG ipatests.pytest_ipa.integration.host.Host.client1.cmd93:transport.py:217 Exit code: 0 INFO ipatests.pytest_ipa.integration.host.Host.client1.ParamikoTransport:transport.py:318 RUN ['su', '-l', 'user2', '-c', 'cd /mnt/smb; stat testdir_user2'] DEBUG ipatests.pytest_ipa.integration.host.Host.client1.cmd94:transport.py:513 RUN ['su', '-l', 'user2', '-c', 'cd /mnt/smb; stat testdir_user2'] DEBUG ipatests.pytest_ipa.integration.host.Host.client1.cmd94:transport.py:558 stat: cannot stat 'testdir_user2': No such file or directory DEBUG ipatests.pytest_ipa.integration.host.Host.client1.cmd94:transport.py:217 Exit code: 1 INFO ipatests.pytest_ipa.integration.host.Host.client0.ParamikoTransport:transport.py:318 RUN ['stat', 'testdir_user2'] DEBUG ipatests.pytest_ipa.integration.host.Host.client0.cmd70:transport.py:513 RUN ['stat', 'testdir_user2'] DEBUG ipatests.pytest_ipa.integration.host.Host.client0.cmd70:transport.py:558 stat: cannot stat 'testdir_user2': No such file or directory DEBUG ipatests.pytest_ipa.integration.host.Host.client0.cmd70:transport.py:217 Exit code: 1 INFO ipatests.pytest_ipa.integration.host.Host.client0.ParamikoTransport:transport.py:318 RUN ['rm', '-rf', 'testdir_user2'] DEBUG ipatests.pytest_ipa.integration.host.Host.client0.cmd71:transport.py:513 RUN ['rm', '-rf', 'testdir_user2'] DEBUG ipatests.pytest_ipa.integration.host.Host.client0.cmd71:transport.py:217 Exit code: 0 INFO ipatests.pytest_ipa.integration.host.Host.client1.ParamikoTransport:transport.py:318 RUN ['umount', '/mnt/smb'] DEBUG ipatests.pytest_ipa.integration.host.Host.client1.cmd95:transport.py:513 RUN ['umount', '/mnt/smb'] DEBUG ipatests.pytest_ipa.integration.host.Host.client1.cmd95:transport.py:217 Exit code: 0 INFO ipatests.pytest_ipa.integration.host.Host.client1.ParamikoTransport:transport.py:318 RUN ['rmdir', '/mnt/smb'] DEBUG ipatests.pytest_ipa.integration.host.Host.client1.cmd96:transport.py:513 RUN ['rmdir', '/mnt/smb'] DEBUG ipatests.pytest_ipa.integration.host.Host.client1.cmd96:transport.py:217 Exit code: 0
Passed test_integration/test_smb.py::TestSMB::test_smb_mount_fails_without_kerberos_ticket 0.36
-------------------------------Captured log setup-------------------------------
INFO ipatests.pytest_ipa.integration.host.Host.client0.ParamikoTransport:transport.py:318 RUN ['mkdir', '/srv/samba_shared'] DEBUG ipatests.pytest_ipa.integration.host.Host.client0.cmd80:transport.py:513 RUN ['mkdir', '/srv/samba_shared'] DEBUG ipatests.pytest_ipa.integration.host.Host.client0.cmd80:transport.py:217 Exit code: 0 INFO ipatests.pytest_ipa.integration.host.Host.client0.ParamikoTransport:transport.py:318 RUN ['chmod', '777', '/srv/samba_shared'] DEBUG ipatests.pytest_ipa.integration.host.Host.client0.cmd81:transport.py:513 RUN ['chmod', '777', '/srv/samba_shared'] DEBUG ipatests.pytest_ipa.integration.host.Host.client0.cmd81:transport.py:217 Exit code: 0 INFO ipatests.pytest_ipa.integration.host.Host.client0.ParamikoTransport:transport.py:318 RUN selinuxenabled DEBUG ipatests.pytest_ipa.integration.host.Host.client0.cmd82:transport.py:513 RUN selinuxenabled DEBUG ipatests.pytest_ipa.integration.host.Host.client0.cmd82:transport.py:217 Exit code: 0 INFO ipatests.pytest_ipa.integration.host.Host.client0.ParamikoTransport:transport.py:318 RUN ['chcon', '-t', 'samba_share_t', '/srv/samba_shared'] DEBUG ipatests.pytest_ipa.integration.host.Host.client0.cmd83:transport.py:513 RUN ['chcon', '-t', 'samba_share_t', '/srv/samba_shared'] DEBUG ipatests.pytest_ipa.integration.host.Host.client0.cmd83:transport.py:217 Exit code: 0 INFO ipatests.pytest_ipa.integration.host.Host.client0.ParamikoTransport:transport.py:318 RUN ['mktemp'] DEBUG ipatests.pytest_ipa.integration.host.Host.client0.cmd84:transport.py:513 RUN ['mktemp'] DEBUG ipatests.pytest_ipa.integration.host.Host.client0.cmd84:transport.py:558 /tmp/tmp.f2gcjLV3Iq DEBUG ipatests.pytest_ipa.integration.host.Host.client0.cmd84:transport.py:217 Exit code: 0 INFO ipatests.pytest_ipa.integration.host.Host.client0.ParamikoTransport:transport.py:318 RUN ['cp', '--preserve=all', '/etc/samba/smb.conf', '/tmp/tmp.f2gcjLV3Iq'] DEBUG ipatests.pytest_ipa.integration.host.Host.client0.cmd85:transport.py:513 RUN ['cp', '--preserve=all', '/etc/samba/smb.conf', '/tmp/tmp.f2gcjLV3Iq'] DEBUG ipatests.pytest_ipa.integration.host.Host.client0.cmd85:transport.py:217 Exit code: 0 DEBUG ipatests.pytest_ipa.integration.host.Host.client0.ParamikoTransport:transport.py:284 READ /etc/samba/smb.conf INFO ipatests.pytest_ipa.integration.host.Host.client0.ParamikoTransport:transport.py:293 WRITE /etc/samba/smb.conf INFO ipatests.pytest_ipa.integration.host.Host.client0.ParamikoTransport:transport.py:318 RUN ['systemctl', 'restart', 'smb'] DEBUG ipatests.pytest_ipa.integration.host.Host.client0.cmd86:transport.py:513 RUN ['systemctl', 'restart', 'smb'] DEBUG ipatests.pytest_ipa.integration.host.Host.client0.cmd86:transport.py:217 Exit code: 0 INFO ipatests.pytest_ipa.integration.host.Host.client0.ParamikoTransport:transport.py:318 RUN ['smbcontrol', 'smbd', 'ping'] DEBUG ipatests.pytest_ipa.integration.host.Host.client0.cmd87:transport.py:513 RUN ['smbcontrol', 'smbd', 'ping'] DEBUG ipatests.pytest_ipa.integration.host.Host.client0.cmd87:transport.py:558 PONG from pid 19986 DEBUG ipatests.pytest_ipa.integration.host.Host.client0.cmd87:transport.py:217 Exit code: 0
-------------------------------Captured log call--------------------------------
INFO ipatests.pytest_ipa.integration.host.Host.client1.ParamikoTransport:transport.py:318 RUN ['kdestroy', '-A'] DEBUG ipatests.pytest_ipa.integration.host.Host.client1.cmd101:transport.py:513 RUN ['kdestroy', '-A'] DEBUG ipatests.pytest_ipa.integration.host.Host.client1.cmd101:transport.py:217 Exit code: 0 INFO ipatests.pytest_ipa.integration.host.Host.client1.ParamikoTransport:transport.py:318 RUN ['mkdir', '-p', '/mnt/smb'] DEBUG ipatests.pytest_ipa.integration.host.Host.client1.cmd102:transport.py:513 RUN ['mkdir', '-p', '/mnt/smb'] DEBUG ipatests.pytest_ipa.integration.host.Host.client1.cmd102:transport.py:217 Exit code: 0 INFO ipatests.pytest_ipa.integration.host.Host.client1.ParamikoTransport:transport.py:318 RUN ['mount', '-t', 'cifs', '//client0.ipa.test/shared', '/mnt/smb', '-o', 'sec=krb5i,multiuser'] DEBUG ipatests.pytest_ipa.integration.host.Host.client1.cmd103:transport.py:513 RUN ['mount', '-t', 'cifs', '//client0.ipa.test/shared', '/mnt/smb', '-o', 'sec=krb5i,multiuser'] DEBUG ipatests.pytest_ipa.integration.host.Host.client1.cmd103:transport.py:558 mount error(2): No such file or directory DEBUG ipatests.pytest_ipa.integration.host.Host.client1.cmd103:transport.py:558 Refer to the mount.cifs(8) manual page (e.g. man mount.cifs) and kernel log messages (dmesg) DEBUG ipatests.pytest_ipa.integration.host.Host.client1.cmd103:transport.py:217 Exit code: 32 INFO ipatests.pytest_ipa.integration.host.Host.client1.ParamikoTransport:transport.py:318 RUN ['umount', '/mnt/smb'] DEBUG ipatests.pytest_ipa.integration.host.Host.client1.cmd104:transport.py:513 RUN ['umount', '/mnt/smb'] DEBUG ipatests.pytest_ipa.integration.host.Host.client1.cmd104:transport.py:558 umount: /mnt/smb: not mounted. DEBUG ipatests.pytest_ipa.integration.host.Host.client1.cmd104:transport.py:217 Exit code: 32 INFO ipatests.pytest_ipa.integration.host.Host.client1.ParamikoTransport:transport.py:318 RUN ['rmdir', '/mnt/smb'] DEBUG ipatests.pytest_ipa.integration.host.Host.client1.cmd105:transport.py:513 RUN ['rmdir', '/mnt/smb'] DEBUG ipatests.pytest_ipa.integration.host.Host.client1.cmd105:transport.py:217 Exit code: 0
Passed test_integration/test_smb.py::TestSMB::test_uninstall_samba 4.42
-------------------------------Captured log call--------------------------------
INFO ipatests.pytest_ipa.integration.host.Host.client0.ParamikoTransport:transport.py:318 RUN ['ipa-client-samba', '--uninstall', '-U'] DEBUG ipatests.pytest_ipa.integration.host.Host.client0.cmd96:transport.py:513 RUN ['ipa-client-samba', '--uninstall', '-U'] DEBUG ipatests.pytest_ipa.integration.host.Host.client0.cmd96:transport.py:558 Samba configuration is reverted. However, Samba databases were fully cleaned and old configuration file will not be usable anymore. DEBUG ipatests.pytest_ipa.integration.host.Host.client0.cmd96:transport.py:217 Exit code: 0 INFO ipatests.pytest_ipa.integration.host.Host.client0.ParamikoTransport:transport.py:318 RUN ['systemctl', 'status', 'winbind'] DEBUG ipatests.pytest_ipa.integration.host.Host.client0.cmd97:transport.py:513 RUN ['systemctl', 'status', 'winbind'] DEBUG ipatests.pytest_ipa.integration.host.Host.client0.cmd97:transport.py:558 ● winbind.service - Samba Winbind Daemon DEBUG ipatests.pytest_ipa.integration.host.Host.client0.cmd97:transport.py:558 Loaded: loaded (/usr/lib/systemd/system/winbind.service; disabled; vendor preset: disabled) DEBUG ipatests.pytest_ipa.integration.host.Host.client0.cmd97:transport.py:558 Active: inactive (dead) DEBUG ipatests.pytest_ipa.integration.host.Host.client0.cmd97:transport.py:558 Docs: man:winbindd(8) DEBUG ipatests.pytest_ipa.integration.host.Host.client0.cmd97:transport.py:558 man:samba(7) DEBUG ipatests.pytest_ipa.integration.host.Host.client0.cmd97:transport.py:558 man:smb.conf(5) DEBUG ipatests.pytest_ipa.integration.host.Host.client0.cmd97:transport.py:558 DEBUG ipatests.pytest_ipa.integration.host.Host.client0.cmd97:transport.py:558 Mar 03 00:23:53 client0.ipa.test winbindd[19011]: [2020/03/03 00:23:53.763712, 0] ../../source3/winbindd/winbindd.c:242(winbindd_sig_term_handler) DEBUG ipatests.pytest_ipa.integration.host.Host.client0.cmd97:transport.py:558 Mar 03 00:23:53 client0.ipa.test winbindd[19015]: [2020/03/03 00:23:53.764314, 0] ../../source3/winbindd/winbindd.c:242(winbindd_sig_term_handler) DEBUG ipatests.pytest_ipa.integration.host.Host.client0.cmd97:transport.py:558 Mar 03 00:23:53 client0.ipa.test winbindd[19017]: [2020/03/03 00:23:53.764805, 0] ../../source3/winbindd/winbindd.c:242(winbindd_sig_term_handler) DEBUG ipatests.pytest_ipa.integration.host.Host.client0.cmd97:transport.py:558 Mar 03 00:23:53 client0.ipa.test winbindd[19017]: Got sig[15] terminate (is_parent=0) DEBUG ipatests.pytest_ipa.integration.host.Host.client0.cmd97:transport.py:558 Mar 03 00:23:53 client0.ipa.test winbindd[19018]: [2020/03/03 00:23:53.766016, 0] ../../source3/winbindd/winbindd.c:242(winbindd_sig_term_handler) DEBUG ipatests.pytest_ipa.integration.host.Host.client0.cmd97:transport.py:558 Mar 03 00:23:53 client0.ipa.test winbindd[19011]: Got sig[15] terminate (is_parent=0) DEBUG ipatests.pytest_ipa.integration.host.Host.client0.cmd97:transport.py:558 Mar 03 00:23:53 client0.ipa.test winbindd[19015]: Got sig[15] terminate (is_parent=0) DEBUG ipatests.pytest_ipa.integration.host.Host.client0.cmd97:transport.py:558 Mar 03 00:23:53 client0.ipa.test winbindd[19018]: Got sig[15] terminate (is_parent=0) DEBUG ipatests.pytest_ipa.integration.host.Host.client0.cmd97:transport.py:558 Mar 03 00:23:53 client0.ipa.test systemd[1]: winbind.service: Succeeded. DEBUG ipatests.pytest_ipa.integration.host.Host.client0.cmd97:transport.py:558 Mar 03 00:23:53 client0.ipa.test systemd[1]: Stopped Samba Winbind Daemon. DEBUG ipatests.pytest_ipa.integration.host.Host.client0.cmd97:transport.py:217 Exit code: 3 INFO ipatests.pytest_ipa.integration.host.Host.client0.ParamikoTransport:transport.py:318 RUN ['systemctl', 'status', 'smb'] DEBUG ipatests.pytest_ipa.integration.host.Host.client0.cmd98:transport.py:513 RUN ['systemctl', 'status', 'smb'] DEBUG ipatests.pytest_ipa.integration.host.Host.client0.cmd98:transport.py:558 ● smb.service - Samba SMB Daemon DEBUG ipatests.pytest_ipa.integration.host.Host.client0.cmd98:transport.py:558 Loaded: loaded (/usr/lib/systemd/system/smb.service; disabled; vendor preset: disabled) DEBUG ipatests.pytest_ipa.integration.host.Host.client0.cmd98:transport.py:558 Active: inactive (dead) DEBUG ipatests.pytest_ipa.integration.host.Host.client0.cmd98:transport.py:558 Docs: man:smbd(8) DEBUG ipatests.pytest_ipa.integration.host.Host.client0.cmd98:transport.py:558 man:samba(7) DEBUG ipatests.pytest_ipa.integration.host.Host.client0.cmd98:transport.py:558 man:smb.conf(5) DEBUG ipatests.pytest_ipa.integration.host.Host.client0.cmd98:transport.py:558 DEBUG ipatests.pytest_ipa.integration.host.Host.client0.cmd98:transport.py:558 Mar 03 00:23:45 client0.ipa.test systemd[1]: Stopped Samba SMB Daemon. DEBUG ipatests.pytest_ipa.integration.host.Host.client0.cmd98:transport.py:558 Mar 03 00:23:45 client0.ipa.test systemd[1]: Starting Samba SMB Daemon... DEBUG ipatests.pytest_ipa.integration.host.Host.client0.cmd98:transport.py:558 Mar 03 00:23:45 client0.ipa.test systemd[1]: Started Samba SMB Daemon. DEBUG ipatests.pytest_ipa.integration.host.Host.client0.cmd98:transport.py:558 Mar 03 00:23:45 client0.ipa.test smbd[20041]: [2020/03/03 00:23:45.311768, 0] ../../lib/util/become_daemon.c:135(daemon_ready) DEBUG ipatests.pytest_ipa.integration.host.Host.client0.cmd98:transport.py:558 Mar 03 00:23:45 client0.ipa.test smbd[20041]: daemon_ready: daemon 'smbd' finished starting up and ready to serve connections DEBUG ipatests.pytest_ipa.integration.host.Host.client0.cmd98:transport.py:558 Mar 03 00:23:47 client0.ipa.test smbd[20041]: [2020/03/03 00:23:47.323922, 0] ../../source3/printing/nt_printing.c:249(nt_printing_init) DEBUG ipatests.pytest_ipa.integration.host.Host.client0.cmd98:transport.py:558 Mar 03 00:23:47 client0.ipa.test smbd[20041]: nt_printing_init: error checking published printers: WERR_ACCESS_DENIED DEBUG ipatests.pytest_ipa.integration.host.Host.client0.cmd98:transport.py:558 Mar 03 00:23:53 client0.ipa.test systemd[1]: Stopping Samba SMB Daemon... DEBUG ipatests.pytest_ipa.integration.host.Host.client0.cmd98:transport.py:558 Mar 03 00:23:53 client0.ipa.test systemd[1]: smb.service: Succeeded. DEBUG ipatests.pytest_ipa.integration.host.Host.client0.cmd98:transport.py:558 Mar 03 00:23:53 client0.ipa.test systemd[1]: Stopped Samba SMB Daemon. DEBUG ipatests.pytest_ipa.integration.host.Host.client0.cmd98:transport.py:217 Exit code: 3
Passed test_integration/test_smb.py::TestSMB::test_repeated_uninstall_samba 0.64
-------------------------------Captured log call--------------------------------
INFO ipatests.pytest_ipa.integration.host.Host.client0.ParamikoTransport:transport.py:318 RUN ['ipa-client-samba', '--uninstall', '-U'] DEBUG ipatests.pytest_ipa.integration.host.Host.client0.cmd103:transport.py:513 RUN ['ipa-client-samba', '--uninstall', '-U'] DEBUG ipatests.pytest_ipa.integration.host.Host.client0.cmd103:transport.py:558 Samba domain member is not configured yet DEBUG ipatests.pytest_ipa.integration.host.Host.client0.cmd103:transport.py:217 Exit code: 0
Passed test_integration/test_smb.py::TestSMB::test_samba_reinstall 11.06
-------------------------------Captured log call--------------------------------
INFO ipatests.pytest_ipa.integration.host.Host.client0.ParamikoTransport:transport.py:318 RUN ['ipa-client-samba', '-U'] DEBUG ipatests.pytest_ipa.integration.host.Host.client0.cmd108:transport.py:513 RUN ['ipa-client-samba', '-U'] DEBUG ipatests.pytest_ipa.integration.host.Host.client0.cmd108:transport.py:558 Searching for IPA server... DEBUG ipatests.pytest_ipa.integration.host.Host.client0.cmd108:transport.py:558 IPA server: ['master.ipa.test'] DEBUG ipatests.pytest_ipa.integration.host.Host.client0.cmd108:transport.py:558 Chosen IPA master: ['master.ipa.test'] DEBUG ipatests.pytest_ipa.integration.host.Host.client0.cmd108:transport.py:558 SMB principal to be created: cifs/client0.ipa.test@IPA.TEST DEBUG ipatests.pytest_ipa.integration.host.Host.client0.cmd108:transport.py:558 NetBIOS name to be used: CLIENT0 DEBUG ipatests.pytest_ipa.integration.host.Host.client0.cmd108:transport.py:558 Discovered domains to use: DEBUG ipatests.pytest_ipa.integration.host.Host.client0.cmd108:transport.py:558 DEBUG ipatests.pytest_ipa.integration.host.Host.client0.cmd108:transport.py:558 Domain name: ipa.test DEBUG ipatests.pytest_ipa.integration.host.Host.client0.cmd108:transport.py:558 NetBIOS name: IPA DEBUG ipatests.pytest_ipa.integration.host.Host.client0.cmd108:transport.py:558 SID: S-1-5-21-1790674050-2471447446-686645324 DEBUG ipatests.pytest_ipa.integration.host.Host.client0.cmd108:transport.py:558 ID range: 1877600000 - 1877799999 DEBUG ipatests.pytest_ipa.integration.host.Host.client0.cmd108:transport.py:558 DEBUG ipatests.pytest_ipa.integration.host.Host.client0.cmd108:transport.py:558 DEBUG ipatests.pytest_ipa.integration.host.Host.client0.cmd108:transport.py:558 Domain name: ad.test DEBUG ipatests.pytest_ipa.integration.host.Host.client0.cmd108:transport.py:558 NetBIOS name: AD DEBUG ipatests.pytest_ipa.integration.host.Host.client0.cmd108:transport.py:558 SID: S-1-5-21-3540055105-4186384300-3258504578 DEBUG ipatests.pytest_ipa.integration.host.Host.client0.cmd108:transport.py:558 ID range: 905800000 - 905999999 DEBUG ipatests.pytest_ipa.integration.host.Host.client0.cmd108:transport.py:558 DEBUG ipatests.pytest_ipa.integration.host.Host.client0.cmd108:transport.py:558 Samba domain member is configured. Please check configuration at /etc/samba/smb.conf and start smb and winbind services DEBUG ipatests.pytest_ipa.integration.host.Host.client0.cmd108:transport.py:217 Exit code: 0 INFO ipatests.pytest_ipa.integration.host.Host.client0.ParamikoTransport:transport.py:318 RUN ['systemctl', 'status', 'smb'] DEBUG ipatests.pytest_ipa.integration.host.Host.client0.cmd109:transport.py:513 RUN ['systemctl', 'status', 'smb'] DEBUG ipatests.pytest_ipa.integration.host.Host.client0.cmd109:transport.py:558 ● smb.service - Samba SMB Daemon DEBUG ipatests.pytest_ipa.integration.host.Host.client0.cmd109:transport.py:558 Loaded: loaded (/usr/lib/systemd/system/smb.service; disabled; vendor preset: disabled) DEBUG ipatests.pytest_ipa.integration.host.Host.client0.cmd109:transport.py:558 Active: inactive (dead) DEBUG ipatests.pytest_ipa.integration.host.Host.client0.cmd109:transport.py:558 Docs: man:smbd(8) DEBUG ipatests.pytest_ipa.integration.host.Host.client0.cmd109:transport.py:558 man:samba(7) DEBUG ipatests.pytest_ipa.integration.host.Host.client0.cmd109:transport.py:558 man:smb.conf(5) DEBUG ipatests.pytest_ipa.integration.host.Host.client0.cmd109:transport.py:558 DEBUG ipatests.pytest_ipa.integration.host.Host.client0.cmd109:transport.py:558 Mar 03 00:23:45 client0.ipa.test systemd[1]: Stopped Samba SMB Daemon. DEBUG ipatests.pytest_ipa.integration.host.Host.client0.cmd109:transport.py:558 Mar 03 00:23:45 client0.ipa.test systemd[1]: Starting Samba SMB Daemon... DEBUG ipatests.pytest_ipa.integration.host.Host.client0.cmd109:transport.py:558 Mar 03 00:23:45 client0.ipa.test systemd[1]: Started Samba SMB Daemon. DEBUG ipatests.pytest_ipa.integration.host.Host.client0.cmd109:transport.py:558 Mar 03 00:23:45 client0.ipa.test smbd[20041]: [2020/03/03 00:23:45.311768, 0] ../../lib/util/become_daemon.c:135(daemon_ready) DEBUG ipatests.pytest_ipa.integration.host.Host.client0.cmd109:transport.py:558 Mar 03 00:23:45 client0.ipa.test smbd[20041]: daemon_ready: daemon 'smbd' finished starting up and ready to serve connections DEBUG ipatests.pytest_ipa.integration.host.Host.client0.cmd109:transport.py:558 Mar 03 00:23:47 client0.ipa.test smbd[20041]: [2020/03/03 00:23:47.323922, 0] ../../source3/printing/nt_printing.c:249(nt_printing_init) DEBUG ipatests.pytest_ipa.integration.host.Host.client0.cmd109:transport.py:558 Mar 03 00:23:47 client0.ipa.test smbd[20041]: nt_printing_init: error checking published printers: WERR_ACCESS_DENIED DEBUG ipatests.pytest_ipa.integration.host.Host.client0.cmd109:transport.py:558 Mar 03 00:23:53 client0.ipa.test systemd[1]: Stopping Samba SMB Daemon... DEBUG ipatests.pytest_ipa.integration.host.Host.client0.cmd109:transport.py:558 Mar 03 00:23:53 client0.ipa.test systemd[1]: smb.service: Succeeded. DEBUG ipatests.pytest_ipa.integration.host.Host.client0.cmd109:transport.py:558 Mar 03 00:23:53 client0.ipa.test systemd[1]: Stopped Samba SMB Daemon. DEBUG ipatests.pytest_ipa.integration.host.Host.client0.cmd109:transport.py:217 Exit code: 3 INFO ipatests.pytest_ipa.integration.host.Host.client0.ParamikoTransport:transport.py:318 RUN ['systemctl', 'status', 'winbind'] DEBUG ipatests.pytest_ipa.integration.host.Host.client0.cmd110:transport.py:513 RUN ['systemctl', 'status', 'winbind'] DEBUG ipatests.pytest_ipa.integration.host.Host.client0.cmd110:transport.py:558 ● winbind.service - Samba Winbind Daemon DEBUG ipatests.pytest_ipa.integration.host.Host.client0.cmd110:transport.py:558 Loaded: loaded (/usr/lib/systemd/system/winbind.service; disabled; vendor preset: disabled) DEBUG ipatests.pytest_ipa.integration.host.Host.client0.cmd110:transport.py:558 Active: inactive (dead) DEBUG ipatests.pytest_ipa.integration.host.Host.client0.cmd110:transport.py:558 Docs: man:winbindd(8) DEBUG ipatests.pytest_ipa.integration.host.Host.client0.cmd110:transport.py:558 man:samba(7) DEBUG ipatests.pytest_ipa.integration.host.Host.client0.cmd110:transport.py:558 man:smb.conf(5) DEBUG ipatests.pytest_ipa.integration.host.Host.client0.cmd110:transport.py:558 DEBUG ipatests.pytest_ipa.integration.host.Host.client0.cmd110:transport.py:558 Mar 03 00:23:53 client0.ipa.test winbindd[19011]: [2020/03/03 00:23:53.763712, 0] ../../source3/winbindd/winbindd.c:242(winbindd_sig_term_handler) DEBUG ipatests.pytest_ipa.integration.host.Host.client0.cmd110:transport.py:558 Mar 03 00:23:53 client0.ipa.test winbindd[19015]: [2020/03/03 00:23:53.764314, 0] ../../source3/winbindd/winbindd.c:242(winbindd_sig_term_handler) DEBUG ipatests.pytest_ipa.integration.host.Host.client0.cmd110:transport.py:558 Mar 03 00:23:53 client0.ipa.test winbindd[19017]: [2020/03/03 00:23:53.764805, 0] ../../source3/winbindd/winbindd.c:242(winbindd_sig_term_handler) DEBUG ipatests.pytest_ipa.integration.host.Host.client0.cmd110:transport.py:558 Mar 03 00:23:53 client0.ipa.test winbindd[19017]: Got sig[15] terminate (is_parent=0) DEBUG ipatests.pytest_ipa.integration.host.Host.client0.cmd110:transport.py:558 Mar 03 00:23:53 client0.ipa.test winbindd[19018]: [2020/03/03 00:23:53.766016, 0] ../../source3/winbindd/winbindd.c:242(winbindd_sig_term_handler) DEBUG ipatests.pytest_ipa.integration.host.Host.client0.cmd110:transport.py:558 Mar 03 00:23:53 client0.ipa.test winbindd[19011]: Got sig[15] terminate (is_parent=0) DEBUG ipatests.pytest_ipa.integration.host.Host.client0.cmd110:transport.py:558 Mar 03 00:23:53 client0.ipa.test winbindd[19015]: Got sig[15] terminate (is_parent=0) DEBUG ipatests.pytest_ipa.integration.host.Host.client0.cmd110:transport.py:558 Mar 03 00:23:53 client0.ipa.test winbindd[19018]: Got sig[15] terminate (is_parent=0) DEBUG ipatests.pytest_ipa.integration.host.Host.client0.cmd110:transport.py:558 Mar 03 00:23:53 client0.ipa.test systemd[1]: winbind.service: Succeeded. DEBUG ipatests.pytest_ipa.integration.host.Host.client0.cmd110:transport.py:558 Mar 03 00:23:53 client0.ipa.test systemd[1]: Stopped Samba Winbind Daemon. DEBUG ipatests.pytest_ipa.integration.host.Host.client0.cmd110:transport.py:217 Exit code: 3 INFO ipatests.pytest_ipa.integration.host.Host.client0.ParamikoTransport:transport.py:318 RUN ['systemctl', 'enable', '--now', 'smb', 'winbind'] DEBUG ipatests.pytest_ipa.integration.host.Host.client0.cmd111:transport.py:513 RUN ['systemctl', 'enable', '--now', 'smb', 'winbind'] DEBUG ipatests.pytest_ipa.integration.host.Host.client0.cmd111:transport.py:558 Created symlink /etc/systemd/system/multi-user.target.wants/smb.service → /usr/lib/systemd/system/smb.service. DEBUG ipatests.pytest_ipa.integration.host.Host.client0.cmd111:transport.py:558 Created symlink /etc/systemd/system/multi-user.target.wants/winbind.service → /usr/lib/systemd/system/winbind.service. DEBUG ipatests.pytest_ipa.integration.host.Host.client0.cmd111:transport.py:217 Exit code: 0 INFO ipatests.pytest_ipa.integration.host.Host.client0.ParamikoTransport:transport.py:318 RUN ['smbcontrol', 'smbd', 'ping'] DEBUG ipatests.pytest_ipa.integration.host.Host.client0.cmd112:transport.py:513 RUN ['smbcontrol', 'smbd', 'ping'] DEBUG ipatests.pytest_ipa.integration.host.Host.client0.cmd112:transport.py:558 PONG from pid 20502 DEBUG ipatests.pytest_ipa.integration.host.Host.client0.cmd112:transport.py:217 Exit code: 0 INFO ipatests.pytest_ipa.integration.host.Host.client0.ParamikoTransport:transport.py:318 RUN ['systemctl', 'status', 'smb'] DEBUG ipatests.pytest_ipa.integration.host.Host.client0.cmd113:transport.py:513 RUN ['systemctl', 'status', 'smb'] DEBUG ipatests.pytest_ipa.integration.host.Host.client0.cmd113:transport.py:558 ● smb.service - Samba SMB Daemon DEBUG ipatests.pytest_ipa.integration.host.Host.client0.cmd113:transport.py:558 Loaded: loaded (/usr/lib/systemd/system/smb.service; enabled; vendor preset: disabled) DEBUG ipatests.pytest_ipa.integration.host.Host.client0.cmd113:transport.py:558 Active: active (running) since Tue 2020-03-03 00:24:11 UTC; 2s ago DEBUG ipatests.pytest_ipa.integration.host.Host.client0.cmd113:transport.py:558 Docs: man:smbd(8) DEBUG ipatests.pytest_ipa.integration.host.Host.client0.cmd113:transport.py:558 man:samba(7) DEBUG ipatests.pytest_ipa.integration.host.Host.client0.cmd113:transport.py:558 man:smb.conf(5) DEBUG ipatests.pytest_ipa.integration.host.Host.client0.cmd113:transport.py:558 Main PID: 20502 (smbd) DEBUG ipatests.pytest_ipa.integration.host.Host.client0.cmd113:transport.py:558 Status: "smbd: ready to serve connections..." DEBUG ipatests.pytest_ipa.integration.host.Host.client0.cmd113:transport.py:558 Tasks: 4 (limit: 1396) DEBUG ipatests.pytest_ipa.integration.host.Host.client0.cmd113:transport.py:558 Memory: 6.3M DEBUG ipatests.pytest_ipa.integration.host.Host.client0.cmd113:transport.py:558 CPU: 65ms DEBUG ipatests.pytest_ipa.integration.host.Host.client0.cmd113:transport.py:558 CGroup: /system.slice/smb.service DEBUG ipatests.pytest_ipa.integration.host.Host.client0.cmd113:transport.py:558 ├─20502 /usr/sbin/smbd --foreground --no-process-group DEBUG ipatests.pytest_ipa.integration.host.Host.client0.cmd113:transport.py:558 ├─20505 /usr/sbin/smbd --foreground --no-process-group DEBUG ipatests.pytest_ipa.integration.host.Host.client0.cmd113:transport.py:558 ├─20506 /usr/sbin/smbd --foreground --no-process-group DEBUG ipatests.pytest_ipa.integration.host.Host.client0.cmd113:transport.py:558 └─20524 /usr/sbin/smbd --foreground --no-process-group DEBUG ipatests.pytest_ipa.integration.host.Host.client0.cmd113:transport.py:558 DEBUG ipatests.pytest_ipa.integration.host.Host.client0.cmd113:transport.py:558 Mar 03 00:24:11 client0.ipa.test systemd[1]: Starting Samba SMB Daemon... DEBUG ipatests.pytest_ipa.integration.host.Host.client0.cmd113:transport.py:558 Mar 03 00:24:11 client0.ipa.test systemd[1]: Started Samba SMB Daemon. DEBUG ipatests.pytest_ipa.integration.host.Host.client0.cmd113:transport.py:558 Mar 03 00:24:11 client0.ipa.test smbd[20502]: [2020/03/03 00:24:11.610797, 0] ../../lib/util/become_daemon.c:135(daemon_ready) DEBUG ipatests.pytest_ipa.integration.host.Host.client0.cmd113:transport.py:558 Mar 03 00:24:11 client0.ipa.test smbd[20502]: daemon_ready: daemon 'smbd' finished starting up and ready to serve connections DEBUG ipatests.pytest_ipa.integration.host.Host.client0.cmd113:transport.py:558 Mar 03 00:24:13 client0.ipa.test smbd[20502]: [2020/03/03 00:24:13.623321, 0] ../../source3/printing/nt_printing.c:249(nt_printing_init) DEBUG ipatests.pytest_ipa.integration.host.Host.client0.cmd113:transport.py:558 Mar 03 00:24:13 client0.ipa.test smbd[20502]: nt_printing_init: error checking published printers: WERR_ACCESS_DENIED DEBUG ipatests.pytest_ipa.integration.host.Host.client0.cmd113:transport.py:217 Exit code: 0 INFO ipatests.pytest_ipa.integration.host.Host.client0.ParamikoTransport:transport.py:318 RUN ['systemctl', 'status', 'winbind'] DEBUG ipatests.pytest_ipa.integration.host.Host.client0.cmd114:transport.py:513 RUN ['systemctl', 'status', 'winbind'] DEBUG ipatests.pytest_ipa.integration.host.Host.client0.cmd114:transport.py:558 ● winbind.service - Samba Winbind Daemon DEBUG ipatests.pytest_ipa.integration.host.Host.client0.cmd114:transport.py:558 Loaded: loaded (/usr/lib/systemd/system/winbind.service; enabled; vendor preset: disabled) DEBUG ipatests.pytest_ipa.integration.host.Host.client0.cmd114:transport.py:558 Active: active (running) since Tue 2020-03-03 00:24:11 UTC; 2s ago DEBUG ipatests.pytest_ipa.integration.host.Host.client0.cmd114:transport.py:558 Docs: man:winbindd(8) DEBUG ipatests.pytest_ipa.integration.host.Host.client0.cmd114:transport.py:558 man:samba(7) DEBUG ipatests.pytest_ipa.integration.host.Host.client0.cmd114:transport.py:558 man:smb.conf(5) DEBUG ipatests.pytest_ipa.integration.host.Host.client0.cmd114:transport.py:558 Main PID: 20500 (winbindd) DEBUG ipatests.pytest_ipa.integration.host.Host.client0.cmd114:transport.py:558 Status: "winbindd: ready to serve connections..." DEBUG ipatests.pytest_ipa.integration.host.Host.client0.cmd114:transport.py:558 Tasks: 3 (limit: 1396) DEBUG ipatests.pytest_ipa.integration.host.Host.client0.cmd114:transport.py:558 Memory: 4.3M DEBUG ipatests.pytest_ipa.integration.host.Host.client0.cmd114:transport.py:558 CPU: 54ms DEBUG ipatests.pytest_ipa.integration.host.Host.client0.cmd114:transport.py:558 CGroup: /system.slice/winbind.service DEBUG ipatests.pytest_ipa.integration.host.Host.client0.cmd114:transport.py:558 ├─20500 /usr/sbin/winbindd --foreground --no-process-group DEBUG ipatests.pytest_ipa.integration.host.Host.client0.cmd114:transport.py:558 ├─20503 /usr/sbin/winbindd --foreground --no-process-group DEBUG ipatests.pytest_ipa.integration.host.Host.client0.cmd114:transport.py:558 └─20507 /usr/sbin/winbindd --foreground --no-process-group DEBUG ipatests.pytest_ipa.integration.host.Host.client0.cmd114:transport.py:558 DEBUG ipatests.pytest_ipa.integration.host.Host.client0.cmd114:transport.py:558 Mar 03 00:24:11 client0.ipa.test systemd[1]: Starting Samba Winbind Daemon... DEBUG ipatests.pytest_ipa.integration.host.Host.client0.cmd114:transport.py:558 Mar 03 00:24:11 client0.ipa.test winbindd[20500]: [2020/03/03 00:24:11.518580, 0] ../../source3/winbindd/winbindd_cache.c:3164(initialize_winbindd_cache) DEBUG ipatests.pytest_ipa.integration.host.Host.client0.cmd114:transport.py:558 Mar 03 00:24:11 client0.ipa.test winbindd[20500]: initialize_winbindd_cache: clearing cache and re-creating with version number 2 DEBUG ipatests.pytest_ipa.integration.host.Host.client0.cmd114:transport.py:558 Mar 03 00:24:11 client0.ipa.test systemd[1]: Started Samba Winbind Daemon. DEBUG ipatests.pytest_ipa.integration.host.Host.client0.cmd114:transport.py:558 Mar 03 00:24:11 client0.ipa.test winbindd[20500]: [2020/03/03 00:24:11.529878, 0] ../../lib/util/become_daemon.c:135(daemon_ready) DEBUG ipatests.pytest_ipa.integration.host.Host.client0.cmd114:transport.py:558 Mar 03 00:24:11 client0.ipa.test winbindd[20500]: daemon_ready: daemon 'winbindd' finished starting up and ready to serve connections DEBUG ipatests.pytest_ipa.integration.host.Host.client0.cmd114:transport.py:217 Exit code: 0 INFO ipatests.pytest_ipa.integration.host.Host.client0.ParamikoTransport:transport.py:318 RUN ['smbstatus'] DEBUG ipatests.pytest_ipa.integration.host.Host.client0.cmd115:transport.py:513 RUN ['smbstatus'] DEBUG ipatests.pytest_ipa.integration.host.Host.client0.cmd115:transport.py:558 DEBUG ipatests.pytest_ipa.integration.host.Host.client0.cmd115:transport.py:558 Samba version 4.11.6 DEBUG ipatests.pytest_ipa.integration.host.Host.client0.cmd115:transport.py:558 PID Username Group Machine Protocol Version Encryption Signing DEBUG ipatests.pytest_ipa.integration.host.Host.client0.cmd115:transport.py:558 ---------------------------------------------------------------------------------------------------------------------------------------- DEBUG ipatests.pytest_ipa.integration.host.Host.client0.cmd115:transport.py:558 DEBUG ipatests.pytest_ipa.integration.host.Host.client0.cmd115:transport.py:558 Service pid Machine Connected at Encryption Signing DEBUG ipatests.pytest_ipa.integration.host.Host.client0.cmd115:transport.py:558 --------------------------------------------------------------------------------------------- DEBUG ipatests.pytest_ipa.integration.host.Host.client0.cmd115:transport.py:558 DEBUG ipatests.pytest_ipa.integration.host.Host.client0.cmd115:transport.py:558 No locked files DEBUG ipatests.pytest_ipa.integration.host.Host.client0.cmd115:transport.py:558 DEBUG ipatests.pytest_ipa.integration.host.Host.client0.cmd115:transport.py:217 Exit code: 0 INFO ipatests.pytest_ipa.integration.host.Host.client1.ParamikoTransport:transport.py:318 RUN ['kdestroy', '-A'] DEBUG ipatests.pytest_ipa.integration.host.Host.client1.cmd118:transport.py:513 RUN ['kdestroy', '-A'] DEBUG ipatests.pytest_ipa.integration.host.Host.client1.cmd118:transport.py:217 Exit code: 0 INFO ipatests.pytest_ipa.integration.host.Host.client1.ParamikoTransport:transport.py:318 RUN ['kinit', 'user1'] DEBUG ipatests.pytest_ipa.integration.host.Host.client1.cmd119:transport.py:513 RUN ['kinit', 'user1'] DEBUG ipatests.pytest_ipa.integration.host.Host.client1.cmd119:transport.py:558 Password for user1@IPA.TEST: DEBUG ipatests.pytest_ipa.integration.host.Host.client1.cmd119:transport.py:217 Exit code: 0 INFO ipatests.pytest_ipa.integration.host.Host.client1.ParamikoTransport:transport.py:318 RUN ['mkdir', '-p', '/mnt/smb'] DEBUG ipatests.pytest_ipa.integration.host.Host.client1.cmd120:transport.py:513 RUN ['mkdir', '-p', '/mnt/smb'] DEBUG ipatests.pytest_ipa.integration.host.Host.client1.cmd120:transport.py:217 Exit code: 0 INFO ipatests.pytest_ipa.integration.host.Host.client1.ParamikoTransport:transport.py:318 RUN ['mount', '-t', 'cifs', '//client0.ipa.test/homes', '/mnt/smb', '-o', 'sec=krb5i,multiuser'] DEBUG ipatests.pytest_ipa.integration.host.Host.client1.cmd121:transport.py:513 RUN ['mount', '-t', 'cifs', '//client0.ipa.test/homes', '/mnt/smb', '-o', 'sec=krb5i,multiuser'] DEBUG ipatests.pytest_ipa.integration.host.Host.client1.cmd121:transport.py:217 Exit code: 0 INFO ipatests.pytest_ipa.integration.host.Host.client1.ParamikoTransport:transport.py:318 RUN ['kdestroy', '-A'] DEBUG ipatests.pytest_ipa.integration.host.Host.client1.cmd122:transport.py:513 RUN ['kdestroy', '-A'] DEBUG ipatests.pytest_ipa.integration.host.Host.client1.cmd122:transport.py:217 Exit code: 0 INFO ipatests.pytest_ipa.integration.host.Host.client1.ParamikoTransport:transport.py:318 RUN ['su', '-l', 'user1', '-c', 'kdestroy -A'] DEBUG ipatests.pytest_ipa.integration.host.Host.client1.cmd123:transport.py:513 RUN ['su', '-l', 'user1', '-c', 'kdestroy -A'] DEBUG ipatests.pytest_ipa.integration.host.Host.client1.cmd123:transport.py:217 Exit code: 0 INFO ipatests.pytest_ipa.integration.host.Host.client1.ParamikoTransport:transport.py:318 RUN ['su', '-l', 'user1', '-c', 'kinit user1'] DEBUG ipatests.pytest_ipa.integration.host.Host.client1.cmd124:transport.py:513 RUN ['su', '-l', 'user1', '-c', 'kinit user1'] DEBUG ipatests.pytest_ipa.integration.host.Host.client1.cmd124:transport.py:558 Password for user1@IPA.TEST: DEBUG ipatests.pytest_ipa.integration.host.Host.client1.cmd124:transport.py:217 Exit code: 0 INFO ipatests.pytest_ipa.integration.host.Host.client1.ParamikoTransport:transport.py:318 RUN ['su', '-l', 'user1', '-c', 'cd /mnt/smb; mkdir testdir_user1'] DEBUG ipatests.pytest_ipa.integration.host.Host.client1.cmd125:transport.py:513 RUN ['su', '-l', 'user1', '-c', 'cd /mnt/smb; mkdir testdir_user1'] DEBUG ipatests.pytest_ipa.integration.host.Host.client1.cmd125:transport.py:217 Exit code: 0 INFO ipatests.pytest_ipa.integration.host.Host.client1.ParamikoTransport:transport.py:318 RUN ['su', '-l', 'user1', '-c', "cd /mnt/smb; stat -c '%n %U %G' testdir_user1"] DEBUG ipatests.pytest_ipa.integration.host.Host.client1.cmd126:transport.py:513 RUN ['su', '-l', 'user1', '-c', "cd /mnt/smb; stat -c '%n %U %G' testdir_user1"] DEBUG ipatests.pytest_ipa.integration.host.Host.client1.cmd126:transport.py:558 testdir_user1 user1 user1 DEBUG ipatests.pytest_ipa.integration.host.Host.client1.cmd126:transport.py:217 Exit code: 0 INFO ipatests.pytest_ipa.integration.host.Host.client0.ParamikoTransport:transport.py:318 RUN ['stat', '-c', '%n %U %G', 'testdir_user1'] DEBUG ipatests.pytest_ipa.integration.host.Host.client0.cmd116:transport.py:513 RUN ['stat', '-c', '%n %U %G', 'testdir_user1'] DEBUG ipatests.pytest_ipa.integration.host.Host.client0.cmd116:transport.py:558 testdir_user1 user1 user1 DEBUG ipatests.pytest_ipa.integration.host.Host.client0.cmd116:transport.py:217 Exit code: 0 INFO ipatests.pytest_ipa.integration.host.Host.client1.ParamikoTransport:transport.py:318 RUN ['su', '-l', 'user1', '-c', 'cd /mnt/smb; printf "Hello, world!" > testdir_user1/testfile_user1'] DEBUG ipatests.pytest_ipa.integration.host.Host.client1.cmd127:transport.py:513 RUN ['su', '-l', 'user1', '-c', 'cd /mnt/smb; printf "Hello, world!" > testdir_user1/testfile_user1'] DEBUG ipatests.pytest_ipa.integration.host.Host.client1.cmd127:transport.py:217 Exit code: 0 INFO ipatests.pytest_ipa.integration.host.Host.client1.ParamikoTransport:transport.py:318 RUN ['su', '-l', 'user1', '-c', 'cd /mnt/smb; ls testdir_user1'] DEBUG ipatests.pytest_ipa.integration.host.Host.client1.cmd128:transport.py:513 RUN ['su', '-l', 'user1', '-c', 'cd /mnt/smb; ls testdir_user1'] DEBUG ipatests.pytest_ipa.integration.host.Host.client1.cmd128:transport.py:558 testfile_user1 DEBUG ipatests.pytest_ipa.integration.host.Host.client1.cmd128:transport.py:217 Exit code: 0 INFO ipatests.pytest_ipa.integration.host.Host.client0.ParamikoTransport:transport.py:318 RUN ['ls', 'testdir_user1'] DEBUG ipatests.pytest_ipa.integration.host.Host.client0.cmd117:transport.py:513 RUN ['ls', 'testdir_user1'] DEBUG ipatests.pytest_ipa.integration.host.Host.client0.cmd117:transport.py:558 testfile_user1 DEBUG ipatests.pytest_ipa.integration.host.Host.client0.cmd117:transport.py:217 Exit code: 0 INFO ipatests.pytest_ipa.integration.host.Host.client0.ParamikoTransport:transport.py:318 RUN ['stat', '-c', '%n %s %U %G', 'testdir_user1/testfile_user1'] DEBUG ipatests.pytest_ipa.integration.host.Host.client0.cmd118:transport.py:513 RUN ['stat', '-c', '%n %s %U %G', 'testdir_user1/testfile_user1'] DEBUG ipatests.pytest_ipa.integration.host.Host.client0.cmd118:transport.py:558 testdir_user1/testfile_user1 13 user1 user1 DEBUG ipatests.pytest_ipa.integration.host.Host.client0.cmd118:transport.py:217 Exit code: 0 INFO ipatests.pytest_ipa.integration.host.Host.client1.ParamikoTransport:transport.py:318 RUN ['su', '-l', 'user1', '-c', "cd /mnt/smb; stat -c '%n %s %U %G' testdir_user1/testfile_user1"] DEBUG ipatests.pytest_ipa.integration.host.Host.client1.cmd129:transport.py:513 RUN ['su', '-l', 'user1', '-c', "cd /mnt/smb; stat -c '%n %s %U %G' testdir_user1/testfile_user1"] DEBUG ipatests.pytest_ipa.integration.host.Host.client1.cmd129:transport.py:558 testdir_user1/testfile_user1 13 user1 user1 DEBUG ipatests.pytest_ipa.integration.host.Host.client1.cmd129:transport.py:217 Exit code: 0 INFO ipatests.pytest_ipa.integration.host.Host.client1.ParamikoTransport:transport.py:318 RUN ['su', '-l', 'user1', '-c', 'cd /mnt/smb; cat testdir_user1/testfile_user1'] DEBUG ipatests.pytest_ipa.integration.host.Host.client1.cmd130:transport.py:513 RUN ['su', '-l', 'user1', '-c', 'cd /mnt/smb; cat testdir_user1/testfile_user1'] DEBUG ipatests.pytest_ipa.integration.host.Host.client1.cmd130:transport.py:558 Hello, world! DEBUG ipatests.pytest_ipa.integration.host.Host.client1.cmd130:transport.py:217 Exit code: 0 DEBUG ipatests.pytest_ipa.integration.host.Host.client0.ParamikoTransport:transport.py:284 READ /home/user1/testdir_user1/testfile_user1 INFO ipatests.pytest_ipa.integration.host.Host.client1.ParamikoTransport:transport.py:318 RUN ['su', '-l', 'user1', '-c', 'cd /mnt/smb; smbclient -k //client0.ipa.test/homes -c dir'] DEBUG ipatests.pytest_ipa.integration.host.Host.client1.cmd131:transport.py:513 RUN ['su', '-l', 'user1', '-c', 'cd /mnt/smb; smbclient -k //client0.ipa.test/homes -c dir'] DEBUG ipatests.pytest_ipa.integration.host.Host.client1.cmd131:transport.py:558 . D 0 Tue Mar 3 00:24:17 2020 DEBUG ipatests.pytest_ipa.integration.host.Host.client1.cmd131:transport.py:558 .. D 0 Tue Mar 3 00:22:35 2020 DEBUG ipatests.pytest_ipa.integration.host.Host.client1.cmd131:transport.py:558 .bashrc H 376 Tue Mar 3 00:22:32 2020 DEBUG ipatests.pytest_ipa.integration.host.Host.client1.cmd131:transport.py:558 .bash_logout H 18 Tue Mar 3 00:22:32 2020 DEBUG ipatests.pytest_ipa.integration.host.Host.client1.cmd131:transport.py:558 .bash_profile H 141 Tue Mar 3 00:22:32 2020 DEBUG ipatests.pytest_ipa.integration.host.Host.client1.cmd131:transport.py:558 .mozilla DH 0 Tue Mar 3 00:22:32 2020 DEBUG ipatests.pytest_ipa.integration.host.Host.client1.cmd131:transport.py:558 testdir_user1 D 0 Tue Mar 3 00:24:18 2020 DEBUG ipatests.pytest_ipa.integration.host.Host.client1.cmd131:transport.py:558 DEBUG ipatests.pytest_ipa.integration.host.Host.client1.cmd131:transport.py:558 41021664 blocks of size 1024. 34566660 blocks available DEBUG ipatests.pytest_ipa.integration.host.Host.client1.cmd131:transport.py:217 Exit code: 0 INFO ipatests.pytest_ipa.integration.host.Host.client1.ParamikoTransport:transport.py:318 RUN ['su', '-l', 'user1', '-c', 'cd /mnt/smb; rm testdir_user1/testfile_user1'] DEBUG ipatests.pytest_ipa.integration.host.Host.client1.cmd132:transport.py:513 RUN ['su', '-l', 'user1', '-c', 'cd /mnt/smb; rm testdir_user1/testfile_user1'] DEBUG ipatests.pytest_ipa.integration.host.Host.client1.cmd132:transport.py:217 Exit code: 0 INFO ipatests.pytest_ipa.integration.host.Host.client1.ParamikoTransport:transport.py:318 RUN ['su', '-l', 'user1', '-c', 'cd /mnt/smb; rmdir testdir_user1'] DEBUG ipatests.pytest_ipa.integration.host.Host.client1.cmd133:transport.py:513 RUN ['su', '-l', 'user1', '-c', 'cd /mnt/smb; rmdir testdir_user1'] DEBUG ipatests.pytest_ipa.integration.host.Host.client1.cmd133:transport.py:217 Exit code: 0 INFO ipatests.pytest_ipa.integration.host.Host.client1.ParamikoTransport:transport.py:318 RUN ['su', '-l', 'user1', '-c', 'cd /mnt/smb; stat testdir_user1'] DEBUG ipatests.pytest_ipa.integration.host.Host.client1.cmd134:transport.py:513 RUN ['su', '-l', 'user1', '-c', 'cd /mnt/smb; stat testdir_user1'] DEBUG ipatests.pytest_ipa.integration.host.Host.client1.cmd134:transport.py:558 stat: cannot stat 'testdir_user1': No such file or directory DEBUG ipatests.pytest_ipa.integration.host.Host.client1.cmd134:transport.py:217 Exit code: 1 INFO ipatests.pytest_ipa.integration.host.Host.client0.ParamikoTransport:transport.py:318 RUN ['stat', 'testdir_user1'] DEBUG ipatests.pytest_ipa.integration.host.Host.client0.cmd119:transport.py:513 RUN ['stat', 'testdir_user1'] DEBUG ipatests.pytest_ipa.integration.host.Host.client0.cmd119:transport.py:558 stat: cannot stat 'testdir_user1': No such file or directory DEBUG ipatests.pytest_ipa.integration.host.Host.client0.cmd119:transport.py:217 Exit code: 1 INFO ipatests.pytest_ipa.integration.host.Host.client0.ParamikoTransport:transport.py:318 RUN ['rm', '-rf', 'testdir_user1'] DEBUG ipatests.pytest_ipa.integration.host.Host.client0.cmd120:transport.py:513 RUN ['rm', '-rf', 'testdir_user1'] DEBUG ipatests.pytest_ipa.integration.host.Host.client0.cmd120:transport.py:217 Exit code: 0 INFO ipatests.pytest_ipa.integration.host.Host.client1.ParamikoTransport:transport.py:318 RUN ['umount', '/mnt/smb'] DEBUG ipatests.pytest_ipa.integration.host.Host.client1.cmd135:transport.py:513 RUN ['umount', '/mnt/smb'] DEBUG ipatests.pytest_ipa.integration.host.Host.client1.cmd135:transport.py:217 Exit code: 0 INFO ipatests.pytest_ipa.integration.host.Host.client1.ParamikoTransport:transport.py:318 RUN ['rmdir', '/mnt/smb'] DEBUG ipatests.pytest_ipa.integration.host.Host.client1.cmd136:transport.py:513 RUN ['rmdir', '/mnt/smb'] DEBUG ipatests.pytest_ipa.integration.host.Host.client1.cmd136:transport.py:217 Exit code: 0
Passed test_integration/test_smb.py::TestSMB::test_cleanup 0.38
-------------------------------Captured log call--------------------------------
INFO ipatests.pytest_ipa.integration.host.WinHost.ad-root.ParamikoTransport:transport.py:318 RUN ['dnscmd', '/zonedelete', 'ipa.test', '/f'] DEBUG ipatests.pytest_ipa.integration.host.WinHost.ad-root.cmd2:transport.py:513 RUN ['dnscmd', '/zonedelete', 'ipa.test', '/f'] DEBUG ipatests.pytest_ipa.integration.host.WinHost.ad-root.cmd2:transport.py:558 Could not chdir to home directory /home/Administrator: No such file or directory DEBUG ipatests.pytest_ipa.integration.host.WinHost.ad-root.cmd2:transport.py:558 -bash: line 1: cd: /home/Administrator: No such file or directory DEBUG ipatests.pytest_ipa.integration.host.WinHost.ad-root.cmd2:transport.py:558 -bash: line 2: /home/Administrator/env.sh: No such file or directory DEBUG ipatests.pytest_ipa.integration.host.WinHost.ad-root.cmd2:transport.py:558 DEBUG ipatests.pytest_ipa.integration.host.WinHost.ad-root.cmd2:transport.py:558 DNS Server . deleted zone ipa.test: DEBUG ipatests.pytest_ipa.integration.host.WinHost.ad-root.cmd2:transport.py:558 Status = 0 (0x00000000) DEBUG ipatests.pytest_ipa.integration.host.WinHost.ad-root.cmd2:transport.py:558 Command completed successfully. DEBUG ipatests.pytest_ipa.integration.host.WinHost.ad-root.cmd2:transport.py:558 DEBUG ipatests.pytest_ipa.integration.host.WinHost.ad-root.cmd2:transport.py:558 TERM environment variable not set. DEBUG ipatests.pytest_ipa.integration.host.WinHost.ad-root.cmd2:transport.py:217 Exit code: 0