report.html

Report generated on 14-Mar-2019 at 23:24:04 by pytest-html v1.19.0

Environment

Packages {'pytest': '3.4.2', 'py': '1.5.4', 'pluggy': '0.6.0'}
Platform Linux-4.19.3-200.fc28.x86_64-x86_64-with-fedora-28-Twenty_Eight
Plugins {'metadata': '1.7.0', 'html': '1.19.0', 'sourceorder': '0.5', 'multihost': '3.0'}
Python 3.6.6

Summary

0 tests ran in 152.21 seconds.

0 passed, 0 skipped, 0 failed, 26 errors, 0 expected failures, 0 unexpected passes

Results

Result Test Duration Links
Error test_caless.py::TestReplicaInstall::()::test_no_certs::setup 100.95
cls = <class 'ipatests.test_integration.test_caless.TestReplicaInstall'>
mh = <pytest_multihost.plugin.MultihostFixture object at 0x7fd6cd899eb8>

@classmethod
def install(cls, mh):
super(TestReplicaInstall, cls).install(mh)
cls.create_pkcs12('ca1/server')
cls.prepare_cacert('ca1')
result = cls.install_server()
> assert result.returncode == 0
E assert 1 == 0
E + where 1 = <pytest_multihost.transport.SSHCommand object at 0x7fd6ce1fa828>.returncode

/usr/lib/python3.6/site-packages/ipatests/test_integration/test_caless.py:799: AssertionError
------------------------------ Captured log setup ------------------------------
__init__.py 250 INFO Preparing host replica0.ipa.test transport.py 1746 INFO Connected (version 2.0, client OpenSSH_7.8) transport.py 247 DEBUG Authenticating with private RSA key using user root transport.py 1746 INFO Authentication (publickey) successful! transport.py 318 INFO RUN ['true'] transport.py 513 DEBUG RUN ['true'] transport.py 558 DEBUG -bash: line 1: cd: /ipatests: No such file or directory transport.py 217 DEBUG Exit code: 0 __init__.py 244 INFO Adding replica0.ipa.test:/ipatests/env.sh to list of logs to collect transport.py 301 DEBUG STAT /ipatests sftp.py 158 INFO [chan 1] Opened sftp connection (server version 3) transport.py 301 DEBUG STAT / transport.py 312 INFO MKDIR /ipatests transport.py 293 INFO WRITE /ipatests/env.sh __init__.py 250 INFO Preparing host master.ipa.test transport.py 1746 INFO Connected (version 2.0, client OpenSSH_7.8) transport.py 247 DEBUG Authenticating with private RSA key using user root transport.py 1746 INFO Authentication (publickey) successful! transport.py 318 INFO RUN ['true'] transport.py 513 DEBUG RUN ['true'] transport.py 558 DEBUG -bash: line 1: cd: /ipatests: No such file or directory transport.py 217 DEBUG Exit code: 0 __init__.py 244 INFO Adding master.ipa.test:/ipatests/env.sh to list of logs to collect transport.py 301 DEBUG STAT /ipatests sftp.py 158 INFO [chan 1] Opened sftp connection (server version 3) transport.py 301 DEBUG STAT / transport.py 312 INFO MKDIR /ipatests transport.py 293 INFO WRITE /ipatests/env.sh test_caless.py 150 INFO Generating certificates to /tmp/ipatest-sgjbnhys transport.py 318 INFO RUN ['true'] transport.py 513 DEBUG RUN ['true'] transport.py 217 DEBUG Exit code: 0 __init__.py 244 INFO Adding master.ipa.test:/ipatests/env.sh to list of logs to collect transport.py 301 DEBUG STAT /ipatests transport.py 293 INFO WRITE /ipatests/env.sh transport.py 301 DEBUG STAT /etc/hostname transport.py 301 DEBUG STAT /ipatests/file_backup/etc transport.py 301 DEBUG STAT /ipatests/file_backup transport.py 301 DEBUG STAT /ipatests transport.py 312 INFO MKDIR /ipatests/file_backup transport.py 312 INFO MKDIR /ipatests/file_backup/etc transport.py 318 INFO RUN ['cp', '-af', '/etc/hostname', '/ipatests/file_backup/etc/hostname'] transport.py 513 DEBUG RUN ['cp', '-af', '/etc/hostname', '/ipatests/file_backup/etc/hostname'] transport.py 217 DEBUG Exit code: 0 transport.py 293 INFO WRITE /etc/hostname transport.py 318 INFO RUN ['hostname', 'master.ipa.test'] transport.py 513 DEBUG RUN ['hostname', 'master.ipa.test'] transport.py 217 DEBUG Exit code: 0 transport.py 318 INFO RUN hostname > '/ipatests/backup_hostname' transport.py 513 DEBUG RUN hostname > '/ipatests/backup_hostname' transport.py 217 DEBUG Exit code: 0 transport.py 318 INFO RUN ['ss', '--all', '--tcp', '--udp', '--numeric', '--processes'] transport.py 513 DEBUG RUN ['ss', '--all', '--tcp', '--udp', '--numeric', '--processes'] transport.py 558 DEBUG Netid State Recv-Q Send-Q Local Address:Port Peer Address:Port transport.py 558 DEBUG udp UNCONN 0 0 0.0.0.0:57112 0.0.0.0:* transport.py 558 DEBUG udp UNCONN 0 0 0.0.0.0:68 0.0.0.0:* users:(("dhclient",pid=1760,fd=6)) transport.py 558 DEBUG udp UNCONN 0 0 0.0.0.0:111 0.0.0.0:* users:(("rpcbind",pid=2162,fd=5),("systemd",pid=1,fd=80)) transport.py 558 DEBUG udp UNCONN 0 0 127.0.0.1:323 0.0.0.0:* users:(("chronyd",pid=456,fd=5)) transport.py 558 DEBUG udp UNCONN 0 0 127.0.0.1:659 0.0.0.0:* users:(("rpc.statd",pid=2163,fd=22)) transport.py 558 DEBUG udp UNCONN 0 0 0.0.0.0:52353 0.0.0.0:* users:(("rpc.statd",pid=2163,fd=7)) transport.py 558 DEBUG udp UNCONN 0 0 0.0.0.0:62612 0.0.0.0:* users:(("rpcbind",pid=2162,fd=10)) transport.py 558 DEBUG udp UNCONN 0 0 [::]:58674 [::]:* transport.py 558 DEBUG udp UNCONN 0 0 [::]:55246 [::]:* users:(("rpcbind",pid=2162,fd=11)) transport.py 558 DEBUG udp UNCONN 0 0 [::]:111 [::]:* users:(("rpcbind",pid=2162,fd=7),("systemd",pid=1,fd=83)) transport.py 558 DEBUG udp UNCONN 0 0 [::]:39077 [::]:* users:(("rpc.statd",pid=2163,fd=9)) transport.py 558 DEBUG udp UNCONN 0 0 [::1]:323 [::]:* users:(("chronyd",pid=456,fd=6)) transport.py 558 DEBUG tcp LISTEN 0 128 0.0.0.0:111 0.0.0.0:* users:(("rpcbind",pid=2162,fd=4),("systemd",pid=1,fd=79)) transport.py 558 DEBUG tcp LISTEN 0 64 0.0.0.0:43219 0.0.0.0:* transport.py 558 DEBUG tcp LISTEN 0 128 0.0.0.0:22 0.0.0.0:* users:(("sshd",pid=2656,fd=3)) transport.py 558 DEBUG tcp LISTEN 0 128 0.0.0.0:43447 0.0.0.0:* users:(("rpc.statd",pid=2163,fd=8)) transport.py 558 DEBUG tcp ESTAB 0 0 192.168.121.37:22 192.168.121.1:59808 users:(("sshd",pid=14212,fd=3),("sshd",pid=14202,fd=3)) transport.py 558 DEBUG tcp ESTAB 0 0 192.168.121.37:22 192.168.121.58:32956 users:(("sshd",pid=14696,fd=3),("sshd",pid=14693,fd=3)) transport.py 558 DEBUG tcp ESTAB 0 0 192.168.121.37:977 192.168.121.1:2049 transport.py 558 DEBUG tcp LISTEN 0 128 [::]:111 [::]:* users:(("rpcbind",pid=2162,fd=6),("systemd",pid=1,fd=82)) transport.py 558 DEBUG tcp LISTEN 0 128 [::]:22 [::]:* users:(("sshd",pid=2656,fd=4)) transport.py 558 DEBUG tcp LISTEN 0 64 [::]:33435 [::]:* transport.py 558 DEBUG tcp LISTEN 0 128 [::]:40159 [::]:* users:(("rpc.statd",pid=2163,fd=10)) transport.py 217 DEBUG Exit code: 0 transport.py 318 INFO RUN ['ss', '--all', '--tcp', '--udp', '--numeric', '--processes', '-o', 'state', 'all', '( sport = :749 or dport = :749 or sport = :464 or dport = :464 )'] transport.py 513 DEBUG RUN ['ss', '--all', '--tcp', '--udp', '--numeric', '--processes', '-o', 'state', 'all', '( sport = :749 or dport = :749 or sport = :464 or dport = :464 )'] transport.py 558 DEBUG Netid State Recv-Q Send-Q Local Address:Port Peer Address:Port transport.py 217 DEBUG Exit code: 0 transport.py 301 DEBUG STAT /ipatests/crl transport.py 301 DEBUG STAT /ipatests transport.py 312 INFO MKDIR /ipatests/crl transport.py 329 INFO PUT /ipatests/crl/ca2.crl transport.py 329 INFO PUT /ipatests/crl/ca1.crl transport.py 329 INFO PUT /ipatests/crl/ca3.crl transport.py 318 INFO RUN ['true'] transport.py 513 DEBUG RUN ['true'] transport.py 217 DEBUG Exit code: 0 __init__.py 244 INFO Adding replica0.ipa.test:/ipatests/env.sh to list of logs to collect transport.py 301 DEBUG STAT /ipatests transport.py 293 INFO WRITE /ipatests/env.sh transport.py 301 DEBUG STAT /etc/hostname transport.py 301 DEBUG STAT /ipatests/file_backup/etc transport.py 301 DEBUG STAT /ipatests/file_backup transport.py 301 DEBUG STAT /ipatests transport.py 312 INFO MKDIR /ipatests/file_backup transport.py 312 INFO MKDIR /ipatests/file_backup/etc transport.py 318 INFO RUN ['cp', '-af', '/etc/hostname', '/ipatests/file_backup/etc/hostname'] transport.py 513 DEBUG RUN ['cp', '-af', '/etc/hostname', '/ipatests/file_backup/etc/hostname'] transport.py 217 DEBUG Exit code: 0 transport.py 293 INFO WRITE /etc/hostname transport.py 318 INFO RUN ['hostname', 'replica0.ipa.test'] transport.py 513 DEBUG RUN ['hostname', 'replica0.ipa.test'] transport.py 217 DEBUG Exit code: 0 transport.py 318 INFO RUN hostname > '/ipatests/backup_hostname' transport.py 513 DEBUG RUN hostname > '/ipatests/backup_hostname' transport.py 217 DEBUG Exit code: 0 transport.py 318 INFO RUN ['ss', '--all', '--tcp', '--udp', '--numeric', '--processes'] transport.py 513 DEBUG RUN ['ss', '--all', '--tcp', '--udp', '--numeric', '--processes'] transport.py 558 DEBUG Netid State Recv-Q Send-Q Local Address:Port Peer Address:Port transport.py 558 DEBUG udp UNCONN 0 0 0.0.0.0:53296 0.0.0.0:* users:(("rpcbind",pid=2163,fd=10)) transport.py 558 DEBUG udp UNCONN 0 0 0.0.0.0:68 0.0.0.0:* users:(("dhclient",pid=1751,fd=6)) transport.py 558 DEBUG udp UNCONN 0 0 0.0.0.0:111 0.0.0.0:* users:(("rpcbind",pid=2163,fd=5),("systemd",pid=1,fd=81)) transport.py 558 DEBUG udp UNCONN 0 0 127.0.0.1:323 0.0.0.0:* users:(("chronyd",pid=453,fd=5)) transport.py 558 DEBUG udp UNCONN 0 0 0.0.0.0:35283 0.0.0.0:* users:(("rpc.statd",pid=2164,fd=7)) transport.py 558 DEBUG udp UNCONN 0 0 0.0.0.0:53789 0.0.0.0:* transport.py 558 DEBUG udp UNCONN 0 0 127.0.0.1:659 0.0.0.0:* users:(("rpc.statd",pid=2164,fd=21)) transport.py 558 DEBUG udp UNCONN 0 0 [::]:56820 [::]:* users:(("rpcbind",pid=2163,fd=11)) transport.py 558 DEBUG udp UNCONN 0 0 [::]:57080 [::]:* transport.py 558 DEBUG udp UNCONN 0 0 [::]:46979 [::]:* users:(("rpc.statd",pid=2164,fd=9)) transport.py 558 DEBUG udp UNCONN 0 0 [::]:111 [::]:* users:(("rpcbind",pid=2163,fd=7),("systemd",pid=1,fd=84)) transport.py 558 DEBUG udp UNCONN 0 0 [::1]:323 [::]:* users:(("chronyd",pid=453,fd=6)) transport.py 558 DEBUG tcp LISTEN 0 64 0.0.0.0:41705 0.0.0.0:* transport.py 558 DEBUG tcp LISTEN 0 128 0.0.0.0:58505 0.0.0.0:* users:(("rpc.statd",pid=2164,fd=8)) transport.py 558 DEBUG tcp LISTEN 0 128 0.0.0.0:111 0.0.0.0:* users:(("rpcbind",pid=2163,fd=4),("systemd",pid=1,fd=80)) transport.py 558 DEBUG tcp LISTEN 0 128 0.0.0.0:22 0.0.0.0:* users:(("sshd",pid=2656,fd=3)) transport.py 558 DEBUG tcp ESTAB 0 0 192.168.121.46:900 192.168.121.1:2049 transport.py 558 DEBUG tcp ESTAB 0 0 192.168.121.46:22 192.168.121.1:37230 users:(("sshd",pid=14213,fd=3),("sshd",pid=14203,fd=3)) transport.py 558 DEBUG tcp ESTAB 0 0 192.168.121.46:22 192.168.121.58:49328 users:(("sshd",pid=14697,fd=3),("sshd",pid=14694,fd=3)) transport.py 558 DEBUG tcp LISTEN 0 64 [::]:42727 [::]:* transport.py 558 DEBUG tcp LISTEN 0 128 [::]:47277 [::]:* users:(("rpc.statd",pid=2164,fd=10)) transport.py 558 DEBUG tcp LISTEN 0 128 [::]:111 [::]:* users:(("rpcbind",pid=2163,fd=6),("systemd",pid=1,fd=83)) transport.py 558 DEBUG tcp LISTEN 0 128 [::]:22 [::]:* users:(("sshd",pid=2656,fd=4)) transport.py 217 DEBUG Exit code: 0 transport.py 318 INFO RUN ['ss', '--all', '--tcp', '--udp', '--numeric', '--processes', '-o', 'state', 'all', '( sport = :749 or dport = :749 or sport = :464 or dport = :464 )'] transport.py 513 DEBUG RUN ['ss', '--all', '--tcp', '--udp', '--numeric', '--processes', '-o', 'state', 'all', '( sport = :749 or dport = :749 or sport = :464 or dport = :464 )'] transport.py 558 DEBUG Netid State Recv-Q Send-Q Local Address:Port Peer Address:Port transport.py 217 DEBUG Exit code: 0 transport.py 301 DEBUG STAT /ipatests/crl transport.py 301 DEBUG STAT /ipatests transport.py 312 INFO MKDIR /ipatests/crl transport.py 329 INFO PUT /ipatests/crl/ca2.crl transport.py 329 INFO PUT /ipatests/crl/ca1.crl transport.py 329 INFO PUT /ipatests/crl/ca3.crl transport.py 318 INFO RUN ['true'] transport.py 513 DEBUG RUN ['true'] transport.py 217 DEBUG Exit code: 0 __init__.py 244 INFO Adding master.ipa.test:/ipatests/env.sh to list of logs to collect transport.py 301 DEBUG STAT /ipatests transport.py 293 INFO WRITE /ipatests/env.sh transport.py 329 INFO PUT /ipatests/root.pem transport.py 329 INFO PUT /ipatests/server.p12 transport.py 318 INFO RUN ['/usr/bin/certutil', '-D', '-d', '/etc/httpd/alias', '-n', 'ca1'] transport.py 513 DEBUG RUN ['/usr/bin/certutil', '-D', '-d', '/etc/httpd/alias', '-n', 'ca1'] transport.py 558 DEBUG certutil: function failed: SEC_ERROR_BAD_DATABASE: security library: bad database. transport.py 217 DEBUG Exit code: 255 transport.py 318 INFO RUN ['/usr/bin/certutil', '-D', '-d', '/etc/httpd/alias', '-n', 'ca1/server'] transport.py 513 DEBUG RUN ['/usr/bin/certutil', '-D', '-d', '/etc/httpd/alias', '-n', 'ca1/server'] transport.py 558 DEBUG certutil: function failed: SEC_ERROR_BAD_DATABASE: security library: bad database. transport.py 217 DEBUG Exit code: 255 __init__.py 244 INFO Adding master.ipa.test:/var/log/dirsrv/slapd-IPA-TEST/errors to list of logs to collect __init__.py 244 INFO Adding master.ipa.test:/var/log/dirsrv/slapd-IPA-TEST/access to list of logs to collect __init__.py 244 INFO Adding master.ipa.test:/var/log/ipaserver-install.log to list of logs to collect __init__.py 244 INFO Adding master.ipa.test:/var/log/ipaserver-uninstall.log to list of logs to collect __init__.py 244 INFO Adding master.ipa.test:/var/log/ipaclient-install.log to list of logs to collect __init__.py 244 INFO Adding master.ipa.test:/var/log/ipaclient-uninstall.log to list of logs to collect __init__.py 244 INFO Adding master.ipa.test:/var/log/ipareplica-install.log to list of logs to collect __init__.py 244 INFO Adding master.ipa.test:/var/log/ipareplica-conncheck.log to list of logs to collect __init__.py 244 INFO Adding master.ipa.test:/var/log/ipareplica-ca-install.log to list of logs to collect __init__.py 244 INFO Adding master.ipa.test:/var/log/ipaserver-kra-install.log to list of logs to collect __init__.py 244 INFO Adding master.ipa.test:/var/log/ipa-custodia.audit.log to list of logs to collect __init__.py 244 INFO Adding master.ipa.test:/var/log/ipaclient-uninstall.log to list of logs to collect __init__.py 244 INFO Adding master.ipa.test:/var/log/iparestore.log to list of logs to collect __init__.py 244 INFO Adding master.ipa.test:/var/log/ipabackup.log to list of logs to collect __init__.py 244 INFO Adding master.ipa.test:/var/log/kadmind.log to list of logs to collect __init__.py 244 INFO Adding master.ipa.test:/var/log/krb5kdc.log to list of logs to collect __init__.py 244 INFO Adding master.ipa.test:/var/log/httpd/error_log to list of logs to collect __init__.py 244 INFO Adding master.ipa.test:/var/log/pki/ to list of logs to collect __init__.py 244 INFO Adding master.ipa.test:/var/log/audit/audit.log to list of logs to collect transport.py 318 INFO RUN ['true'] transport.py 513 DEBUG RUN ['true'] transport.py 217 DEBUG Exit code: 0 __init__.py 244 INFO Adding master.ipa.test:/ipatests/env.sh to list of logs to collect transport.py 301 DEBUG STAT /ipatests transport.py 293 INFO WRITE /ipatests/env.sh transport.py 301 DEBUG STAT /etc/hostname transport.py 301 DEBUG STAT /ipatests/file_backup/etc transport.py 318 INFO RUN ['cp', '-af', '/etc/hostname', '/ipatests/file_backup/etc/hostname'] transport.py 513 DEBUG RUN ['cp', '-af', '/etc/hostname', '/ipatests/file_backup/etc/hostname'] transport.py 217 DEBUG Exit code: 0 transport.py 293 INFO WRITE /etc/hostname transport.py 318 INFO RUN ['hostname', 'master.ipa.test'] transport.py 513 DEBUG RUN ['hostname', 'master.ipa.test'] transport.py 217 DEBUG Exit code: 0 transport.py 318 INFO RUN hostname > '/ipatests/backup_hostname' transport.py 513 DEBUG RUN hostname > '/ipatests/backup_hostname' transport.py 217 DEBUG Exit code: 0 transport.py 318 INFO RUN ['ss', '--all', '--tcp', '--udp', '--numeric', '--processes'] transport.py 513 DEBUG RUN ['ss', '--all', '--tcp', '--udp', '--numeric', '--processes'] transport.py 558 DEBUG Netid State Recv-Q Send-Q Local Address:Port Peer Address:Port transport.py 558 DEBUG udp UNCONN 0 0 0.0.0.0:57112 0.0.0.0:* transport.py 558 DEBUG udp UNCONN 0 0 0.0.0.0:68 0.0.0.0:* users:(("dhclient",pid=1760,fd=6)) transport.py 558 DEBUG udp UNCONN 0 0 0.0.0.0:111 0.0.0.0:* users:(("rpcbind",pid=2162,fd=5),("systemd",pid=1,fd=80)) transport.py 558 DEBUG udp UNCONN 0 0 127.0.0.1:323 0.0.0.0:* users:(("chronyd",pid=456,fd=5)) transport.py 558 DEBUG udp UNCONN 0 0 127.0.0.1:659 0.0.0.0:* users:(("rpc.statd",pid=2163,fd=22)) transport.py 558 DEBUG udp UNCONN 0 0 0.0.0.0:52353 0.0.0.0:* users:(("rpc.statd",pid=2163,fd=7)) transport.py 558 DEBUG udp UNCONN 0 0 0.0.0.0:62612 0.0.0.0:* users:(("rpcbind",pid=2162,fd=10)) transport.py 558 DEBUG udp UNCONN 0 0 [::]:58674 [::]:* transport.py 558 DEBUG udp UNCONN 0 0 [::]:55246 [::]:* users:(("rpcbind",pid=2162,fd=11)) transport.py 558 DEBUG udp UNCONN 0 0 [::]:111 [::]:* users:(("rpcbind",pid=2162,fd=7),("systemd",pid=1,fd=83)) transport.py 558 DEBUG udp UNCONN 0 0 [::]:39077 [::]:* users:(("rpc.statd",pid=2163,fd=9)) transport.py 558 DEBUG udp UNCONN 0 0 [::1]:323 [::]:* users:(("chronyd",pid=456,fd=6)) transport.py 558 DEBUG tcp LISTEN 0 128 0.0.0.0:111 0.0.0.0:* users:(("rpcbind",pid=2162,fd=4),("systemd",pid=1,fd=79)) transport.py 558 DEBUG tcp LISTEN 0 64 0.0.0.0:43219 0.0.0.0:* transport.py 558 DEBUG tcp LISTEN 0 128 0.0.0.0:22 0.0.0.0:* users:(("sshd",pid=2656,fd=3)) transport.py 558 DEBUG tcp LISTEN 0 128 0.0.0.0:43447 0.0.0.0:* users:(("rpc.statd",pid=2163,fd=8)) transport.py 558 DEBUG tcp ESTAB 0 0 192.168.121.37:22 192.168.121.1:59808 users:(("sshd",pid=14212,fd=3),("sshd",pid=14202,fd=3)) transport.py 558 DEBUG tcp ESTAB 0 0 192.168.121.37:22 192.168.121.58:32956 users:(("sshd",pid=14696,fd=3),("sshd",pid=14693,fd=3)) transport.py 558 DEBUG tcp ESTAB 0 0 192.168.121.37:977 192.168.121.1:2049 transport.py 558 DEBUG tcp LISTEN 0 128 [::]:111 [::]:* users:(("rpcbind",pid=2162,fd=6),("systemd",pid=1,fd=82)) transport.py 558 DEBUG tcp LISTEN 0 128 [::]:22 [::]:* users:(("sshd",pid=2656,fd=4)) transport.py 558 DEBUG tcp LISTEN 0 64 [::]:33435 [::]:* transport.py 558 DEBUG tcp LISTEN 0 128 [::]:40159 [::]:* users:(("rpc.statd",pid=2163,fd=10)) transport.py 217 DEBUG Exit code: 0 transport.py 318 INFO RUN ['ss', '--all', '--tcp', '--udp', '--numeric', '--processes', '-o', 'state', 'all', '( sport = :749 or dport = :749 or sport = :464 or dport = :464 )'] transport.py 513 DEBUG RUN ['ss', '--all', '--tcp', '--udp', '--numeric', '--processes', '-o', 'state', 'all', '( sport = :749 or dport = :749 or sport = :464 or dport = :464 )'] transport.py 558 DEBUG Netid State Recv-Q Send-Q Local Address:Port Peer Address:Port transport.py 217 DEBUG Exit code: 0 transport.py 301 DEBUG STAT /bin/systemctl transport.py 318 INFO RUN ['systemctl', 'stop', 'httpd'] transport.py 513 DEBUG RUN ['systemctl', 'stop', 'httpd'] transport.py 217 DEBUG Exit code: 0 transport.py 318 INFO RUN for line in `ipcs -s | grep apache | cut -d " " -f 2`; do ipcrm -s $line; done transport.py 513 DEBUG RUN for line in `ipcs -s | grep apache | cut -d " " -f 2`; do ipcrm -s $line; done transport.py 217 DEBUG Exit code: 0 transport.py 318 INFO RUN ['systemctl', 'unmask', 'firewalld'] transport.py 513 DEBUG RUN ['systemctl', 'unmask', 'firewalld'] transport.py 558 DEBUG Removed /etc/systemd/system/firewalld.service. transport.py 217 DEBUG Exit code: 0 transport.py 318 INFO RUN ['systemctl', 'enable', 'firewalld'] transport.py 513 DEBUG RUN ['systemctl', 'enable', 'firewalld'] transport.py 217 DEBUG Exit code: 0 transport.py 318 INFO RUN ['systemctl', 'start', 'firewalld'] transport.py 513 DEBUG RUN ['systemctl', 'start', 'firewalld'] transport.py 217 DEBUG Exit code: 0 transport.py 318 INFO RUN ['ipa-server-install', '-n', 'ipa.test', '-r', 'IPA.TEST', '-p', 'Secret.123', '-a', 'Secret.123', '--domain-level=1', '-U', '--setup-dns', '--forwarder', '192.168.121.1', '--auto-reverse', '--http-cert-file', '/ipatests/server.p12', '--dirsrv-cert-file', '/ipatests/server.p12', '--ca-cert-file', '/ipatests/root.pem', '--ip-address', '192.168.121.37', '--no-pkinit', '--http-pin', 'Secret.123', '--dirsrv-pin', 'Secret.123'] transport.py 513 DEBUG RUN ['ipa-server-install', '-n', 'ipa.test', '-r', 'IPA.TEST', '-p', 'Secret.123', '-a', 'Secret.123', '--domain-level=1', '-U', '--setup-dns', '--forwarder', '192.168.121.1', '--auto-reverse', '--http-cert-file', '/ipatests/server.p12', '--dirsrv-cert-file', '/ipatests/server.p12', '--ca-cert-file', '/ipatests/root.pem', '--ip-address', '192.168.121.37', '--no-pkinit', '--http-pin', 'Secret.123', '--dirsrv-pin', 'Secret.123'] transport.py 558 DEBUG Checking DNS domain ipa.test, please wait ... transport.py 558 DEBUG DNS check for domain ipa.test. failed: The DNS operation timed out after 30.0016508102417 seconds. transport.py 558 DEBUG Checking DNS domain ipa.test., please wait ... transport.py 558 DEBUG DNS check for domain ipa.test. failed: The DNS operation timed out after 30.001196146011353 seconds. transport.py 558 DEBUG DNS server 192.168.121.1: query '. SOA': The DNS operation timed out after 10.001180648803711 seconds transport.py 558 DEBUG DNS server 192.168.121.1: query '. SOA': The DNS operation timed out after 10.001180648803711 seconds transport.py 558 DEBUG The ipa-server-install command failed. See /var/log/ipaserver-install.log for more information transport.py 558 DEBUG Checking DNS domain ipa.test, please wait ... transport.py 558 DEBUG transport.py 558 DEBUG The log file for this installation can be found in /var/log/ipaserver-install.log transport.py 558 DEBUG ============================================================================== transport.py 558 DEBUG This program will set up the FreeIPA Server. transport.py 558 DEBUG Version 4.7.90test transport.py 558 DEBUG transport.py 558 DEBUG This includes: transport.py 558 DEBUG * Configure the NTP client (chronyd) transport.py 558 DEBUG * Create and configure an instance of Directory Server transport.py 558 DEBUG * Create and configure a Kerberos Key Distribution Center (KDC) transport.py 558 DEBUG * Configure Apache (httpd) transport.py 558 DEBUG * Configure DNS (bind) transport.py 558 DEBUG transport.py 558 DEBUG Warning: skipping DNS resolution of host master.ipa.test transport.py 558 DEBUG Checking DNS forwarders, please wait ... transport.py 217 DEBUG Exit code: 1 __init__.py 134 INFO Collecting logs from: replica0.ipa.test transport.py 318 INFO RUN ['mktemp'] transport.py 513 DEBUG RUN ['mktemp'] transport.py 558 DEBUG /tmp/tmp.nGO8Guz6mG transport.py 217 DEBUG Exit code: 0 transport.py 318 INFO RUN ['tar', 'cJvf', '/tmp/tmp.nGO8Guz6mG', '--ignore-failed-read', '/ipatests/env.sh', '/ipatests/env.sh'] transport.py 513 DEBUG RUN ['tar', 'cJvf', '/tmp/tmp.nGO8Guz6mG', '--ignore-failed-read', '/ipatests/env.sh', '/ipatests/env.sh'] transport.py 558 DEBUG tar: Removing leading `/' from member names transport.py 558 DEBUG tar: Removing leading `/' from hard link targets transport.py 217 DEBUG Exit code: 0 transport.py 284 DEBUG READ /tmp/tmp.nGO8Guz6mG transport.py 318 INFO RUN ['rm', '-f', '/tmp/tmp.nGO8Guz6mG'] transport.py 513 DEBUG RUN ['rm', '-f', '/tmp/tmp.nGO8Guz6mG'] transport.py 217 DEBUG Exit code: 0 __init__.py 134 INFO Collecting logs from: master.ipa.test transport.py 318 INFO RUN ['mktemp'] transport.py 513 DEBUG RUN ['mktemp'] transport.py 558 DEBUG /tmp/tmp.b47BRZGd9O transport.py 217 DEBUG Exit code: 0 transport.py 318 INFO RUN ['tar', 'cJvf', '/tmp/tmp.b47BRZGd9O', '--ignore-failed-read', '/ipatests/env.sh', '/ipatests/env.sh', '/ipatests/env.sh', '/var/log/dirsrv/slapd-IPA-TEST/errors', '/var/log/dirsrv/slapd-IPA-TEST/access', '/var/log/ipaserver-install.log', '/var/log/ipaserver-uninstall.log', '/var/log/ipaclient-install.log', '/var/log/ipaclient-uninstall.log', '/var/log/ipareplica-install.log', '/var/log/ipareplica-conncheck.log', '/var/log/ipareplica-ca-install.log', '/var/log/ipaserver-kra-install.log', '/var/log/ipa-custodia.audit.log', '/var/log/ipaclient-uninstall.log', '/var/log/iparestore.log', '/var/log/ipabackup.log', '/var/log/kadmind.log', '/var/log/krb5kdc.log', '/var/log/httpd/error_log', '/var/log/pki/', '/var/log/audit/audit.log', '/ipatests/env.sh'] transport.py 513 DEBUG RUN ['tar', 'cJvf', '/tmp/tmp.b47BRZGd9O', '--ignore-failed-read', '/ipatests/env.sh', '/ipatests/env.sh', '/ipatests/env.sh', '/var/log/dirsrv/slapd-IPA-TEST/errors', '/var/log/dirsrv/slapd-IPA-TEST/access', '/var/log/ipaserver-install.log', '/var/log/ipaserver-uninstall.log', '/var/log/ipaclient-install.log', '/var/log/ipaclient-uninstall.log', '/var/log/ipareplica-install.log', '/var/log/ipareplica-conncheck.log', '/var/log/ipareplica-ca-install.log', '/var/log/ipaserver-kra-install.log', '/var/log/ipa-custodia.audit.log', '/var/log/ipaclient-uninstall.log', '/var/log/iparestore.log', '/var/log/ipabackup.log', '/var/log/kadmind.log', '/var/log/krb5kdc.log', '/var/log/httpd/error_log', '/var/log/pki/', '/var/log/audit/audit.log', '/ipatests/env.sh'] transport.py 558 DEBUG tar: Removing leading `/' from member names transport.py 558 DEBUG tar: Removing leading `/' from hard link targets transport.py 558 DEBUG tar: /var/log/dirsrv/slapd-IPA-TEST/errors: Warning: Cannot stat: No such file or directory transport.py 558 DEBUG tar: /var/log/dirsrv/slapd-IPA-TEST/access: Warning: Cannot stat: No such file or directory transport.py 558 DEBUG tar: /var/log/ipaserver-uninstall.log: Warning: Cannot stat: No such file or directory transport.py 558 DEBUG tar: /var/log/ipaclient-install.log: Warning: Cannot stat: No such file or directory transport.py 558 DEBUG tar: /var/log/ipaclient-uninstall.log: Warning: Cannot stat: No such file or directory transport.py 558 DEBUG tar: /var/log/ipareplica-install.log: Warning: Cannot stat: No such file or directory transport.py 558 DEBUG tar: /var/log/ipareplica-conncheck.log: Warning: Cannot stat: No such file or directory transport.py 558 DEBUG tar: /var/log/ipareplica-ca-install.log: Warning: Cannot stat: No such file or directory transport.py 558 DEBUG tar: /var/log/ipaserver-kra-install.log: Warning: Cannot stat: No such file or directory transport.py 558 DEBUG tar: /var/log/ipa-custodia.audit.log: Warning: Cannot stat: No such file or directory transport.py 558 DEBUG tar: /var/log/ipaclient-uninstall.log: Warning: Cannot stat: No such file or directory transport.py 558 DEBUG tar: /var/log/iparestore.log: Warning: Cannot stat: No such file or directory transport.py 558 DEBUG tar: /var/log/ipabackup.log: Warning: Cannot stat: No such file or directory transport.py 558 DEBUG tar: /var/log/kadmind.log: Warning: Cannot stat: No such file or directory transport.py 558 DEBUG tar: /var/log/krb5kdc.log: Warning: Cannot stat: No such file or directory transport.py 558 DEBUG tar: /var/log/httpd/error_log: Warning: Cannot stat: No such file or directory transport.py 217 DEBUG Exit code: 0 transport.py 284 DEBUG READ /tmp/tmp.b47BRZGd9O transport.py 318 INFO RUN ['rm', '-f', '/tmp/tmp.b47BRZGd9O'] transport.py 513 DEBUG RUN ['rm', '-f', '/tmp/tmp.b47BRZGd9O'] transport.py 217 DEBUG Exit code: 0 __init__.py 90 INFO Collecting journal from: master.ipa.test transport.py 318 INFO RUN ['journalctl', '--since', '-1h'] transport.py 513 DEBUG RUN ['journalctl', '--since', '-1h'] transport.py 217 DEBUG Exit code: 0 __init__.py 90 INFO Collecting journal from: replica0.ipa.test transport.py 318 INFO RUN ['journalctl', '--since', '-1h'] transport.py 513 DEBUG RUN ['journalctl', '--since', '-1h'] transport.py 217 DEBUG Exit code: 0
Error test_caless.py::TestReplicaInstall::()::test_nonexistent_http_pkcs12_file::setup 0.00
cls = <class 'ipatests.test_integration.test_caless.TestReplicaInstall'>
mh = <pytest_multihost.plugin.MultihostFixture object at 0x7fd6cd899eb8>

@classmethod
def install(cls, mh):
super(TestReplicaInstall, cls).install(mh)
cls.create_pkcs12('ca1/server')
cls.prepare_cacert('ca1')
result = cls.install_server()
> assert result.returncode == 0
E assert 1 == 0
E + where 1 = <pytest_multihost.transport.SSHCommand object at 0x7fd6ce1fa828>.returncode

/usr/lib/python3.6/site-packages/ipatests/test_integration/test_caless.py:799: AssertionError
Error test_caless.py::TestReplicaInstall::()::test_nonexistent_ds_pkcs12_file::setup 0.00
cls = <class 'ipatests.test_integration.test_caless.TestReplicaInstall'>
mh = <pytest_multihost.plugin.MultihostFixture object at 0x7fd6cd899eb8>

@classmethod
def install(cls, mh):
super(TestReplicaInstall, cls).install(mh)
cls.create_pkcs12('ca1/server')
cls.prepare_cacert('ca1')
result = cls.install_server()
> assert result.returncode == 0
E assert 1 == 0
E + where 1 = <pytest_multihost.transport.SSHCommand object at 0x7fd6ce1fa828>.returncode

/usr/lib/python3.6/site-packages/ipatests/test_integration/test_caless.py:799: AssertionError
Error test_caless.py::TestReplicaInstall::()::test_incorect_http_pin::setup 0.00
cls = <class 'ipatests.test_integration.test_caless.TestReplicaInstall'>
mh = <pytest_multihost.plugin.MultihostFixture object at 0x7fd6cd899eb8>

@classmethod
def install(cls, mh):
super(TestReplicaInstall, cls).install(mh)
cls.create_pkcs12('ca1/server')
cls.prepare_cacert('ca1')
result = cls.install_server()
> assert result.returncode == 0
E assert 1 == 0
E + where 1 = <pytest_multihost.transport.SSHCommand object at 0x7fd6ce1fa828>.returncode

/usr/lib/python3.6/site-packages/ipatests/test_integration/test_caless.py:799: AssertionError
Error test_caless.py::TestReplicaInstall::()::test_incorect_ds_pin::setup 0.00
cls = <class 'ipatests.test_integration.test_caless.TestReplicaInstall'>
mh = <pytest_multihost.plugin.MultihostFixture object at 0x7fd6cd899eb8>

@classmethod
def install(cls, mh):
super(TestReplicaInstall, cls).install(mh)
cls.create_pkcs12('ca1/server')
cls.prepare_cacert('ca1')
result = cls.install_server()
> assert result.returncode == 0
E assert 1 == 0
E + where 1 = <pytest_multihost.transport.SSHCommand object at 0x7fd6ce1fa828>.returncode

/usr/lib/python3.6/site-packages/ipatests/test_integration/test_caless.py:799: AssertionError
Error test_caless.py::TestReplicaInstall::()::test_http_unknown_ca::setup 0.00
cls = <class 'ipatests.test_integration.test_caless.TestReplicaInstall'>
mh = <pytest_multihost.plugin.MultihostFixture object at 0x7fd6cd899eb8>

@classmethod
def install(cls, mh):
super(TestReplicaInstall, cls).install(mh)
cls.create_pkcs12('ca1/server')
cls.prepare_cacert('ca1')
result = cls.install_server()
> assert result.returncode == 0
E assert 1 == 0
E + where 1 = <pytest_multihost.transport.SSHCommand object at 0x7fd6ce1fa828>.returncode

/usr/lib/python3.6/site-packages/ipatests/test_integration/test_caless.py:799: AssertionError
Error test_caless.py::TestReplicaInstall::()::test_ds_unknown_ca::setup 0.00
cls = <class 'ipatests.test_integration.test_caless.TestReplicaInstall'>
mh = <pytest_multihost.plugin.MultihostFixture object at 0x7fd6cd899eb8>

@classmethod
def install(cls, mh):
super(TestReplicaInstall, cls).install(mh)
cls.create_pkcs12('ca1/server')
cls.prepare_cacert('ca1')
result = cls.install_server()
> assert result.returncode == 0
E assert 1 == 0
E + where 1 = <pytest_multihost.transport.SSHCommand object at 0x7fd6ce1fa828>.returncode

/usr/lib/python3.6/site-packages/ipatests/test_integration/test_caless.py:799: AssertionError
Error test_caless.py::TestReplicaInstall::()::test_invalid_http_cn::setup 0.00
cls = <class 'ipatests.test_integration.test_caless.TestReplicaInstall'>
mh = <pytest_multihost.plugin.MultihostFixture object at 0x7fd6cd899eb8>

@classmethod
def install(cls, mh):
super(TestReplicaInstall, cls).install(mh)
cls.create_pkcs12('ca1/server')
cls.prepare_cacert('ca1')
result = cls.install_server()
> assert result.returncode == 0
E assert 1 == 0
E + where 1 = <pytest_multihost.transport.SSHCommand object at 0x7fd6ce1fa828>.returncode

/usr/lib/python3.6/site-packages/ipatests/test_integration/test_caless.py:799: AssertionError
Error test_caless.py::TestReplicaInstall::()::test_invalid_ds_cn::setup 0.00
cls = <class 'ipatests.test_integration.test_caless.TestReplicaInstall'>
mh = <pytest_multihost.plugin.MultihostFixture object at 0x7fd6cd899eb8>

@classmethod
def install(cls, mh):
super(TestReplicaInstall, cls).install(mh)
cls.create_pkcs12('ca1/server')
cls.prepare_cacert('ca1')
result = cls.install_server()
> assert result.returncode == 0
E assert 1 == 0
E + where 1 = <pytest_multihost.transport.SSHCommand object at 0x7fd6ce1fa828>.returncode

/usr/lib/python3.6/site-packages/ipatests/test_integration/test_caless.py:799: AssertionError
Error test_caless.py::TestReplicaInstall::()::test_expired_http::setup 0.00
cls = <class 'ipatests.test_integration.test_caless.TestReplicaInstall'>
mh = <pytest_multihost.plugin.MultihostFixture object at 0x7fd6cd899eb8>

@classmethod
def install(cls, mh):
super(TestReplicaInstall, cls).install(mh)
cls.create_pkcs12('ca1/server')
cls.prepare_cacert('ca1')
result = cls.install_server()
> assert result.returncode == 0
E assert 1 == 0
E + where 1 = <pytest_multihost.transport.SSHCommand object at 0x7fd6ce1fa828>.returncode

/usr/lib/python3.6/site-packages/ipatests/test_integration/test_caless.py:799: AssertionError
Error test_caless.py::TestReplicaInstall::()::test_expired_ds::setup 0.00
cls = <class 'ipatests.test_integration.test_caless.TestReplicaInstall'>
mh = <pytest_multihost.plugin.MultihostFixture object at 0x7fd6cd899eb8>

@classmethod
def install(cls, mh):
super(TestReplicaInstall, cls).install(mh)
cls.create_pkcs12('ca1/server')
cls.prepare_cacert('ca1')
result = cls.install_server()
> assert result.returncode == 0
E assert 1 == 0
E + where 1 = <pytest_multihost.transport.SSHCommand object at 0x7fd6ce1fa828>.returncode

/usr/lib/python3.6/site-packages/ipatests/test_integration/test_caless.py:799: AssertionError
Error test_caless.py::TestReplicaInstall::()::test_http_bad_usage::setup 0.00
cls = <class 'ipatests.test_integration.test_caless.TestReplicaInstall'>
mh = <pytest_multihost.plugin.MultihostFixture object at 0x7fd6cd899eb8>

@classmethod
def install(cls, mh):
super(TestReplicaInstall, cls).install(mh)
cls.create_pkcs12('ca1/server')
cls.prepare_cacert('ca1')
result = cls.install_server()
> assert result.returncode == 0
E assert 1 == 0
E + where 1 = <pytest_multihost.transport.SSHCommand object at 0x7fd6ce1fa828>.returncode

/usr/lib/python3.6/site-packages/ipatests/test_integration/test_caless.py:799: AssertionError
Error test_caless.py::TestReplicaInstall::()::test_ds_bad_usage::setup 0.00
cls = <class 'ipatests.test_integration.test_caless.TestReplicaInstall'>
mh = <pytest_multihost.plugin.MultihostFixture object at 0x7fd6cd899eb8>

@classmethod
def install(cls, mh):
super(TestReplicaInstall, cls).install(mh)
cls.create_pkcs12('ca1/server')
cls.prepare_cacert('ca1')
result = cls.install_server()
> assert result.returncode == 0
E assert 1 == 0
E + where 1 = <pytest_multihost.transport.SSHCommand object at 0x7fd6ce1fa828>.returncode

/usr/lib/python3.6/site-packages/ipatests/test_integration/test_caless.py:799: AssertionError
Error test_caless.py::TestReplicaInstall::()::test_http_intermediate_ca::setup 0.00
cls = <class 'ipatests.test_integration.test_caless.TestReplicaInstall'>
mh = <pytest_multihost.plugin.MultihostFixture object at 0x7fd6cd899eb8>

@classmethod
def install(cls, mh):
super(TestReplicaInstall, cls).install(mh)
cls.create_pkcs12('ca1/server')
cls.prepare_cacert('ca1')
result = cls.install_server()
> assert result.returncode == 0
E assert 1 == 0
E + where 1 = <pytest_multihost.transport.SSHCommand object at 0x7fd6ce1fa828>.returncode

/usr/lib/python3.6/site-packages/ipatests/test_integration/test_caless.py:799: AssertionError
Error test_caless.py::TestReplicaInstall::()::test_ds_intermediate_ca::setup 0.00
cls = <class 'ipatests.test_integration.test_caless.TestReplicaInstall'>
mh = <pytest_multihost.plugin.MultihostFixture object at 0x7fd6cd899eb8>

@classmethod
def install(cls, mh):
super(TestReplicaInstall, cls).install(mh)
cls.create_pkcs12('ca1/server')
cls.prepare_cacert('ca1')
result = cls.install_server()
> assert result.returncode == 0
E assert 1 == 0
E + where 1 = <pytest_multihost.transport.SSHCommand object at 0x7fd6ce1fa828>.returncode

/usr/lib/python3.6/site-packages/ipatests/test_integration/test_caless.py:799: AssertionError
Error test_caless.py::TestReplicaInstall::()::test_valid_certs::setup 0.00
cls = <class 'ipatests.test_integration.test_caless.TestReplicaInstall'>
mh = <pytest_multihost.plugin.MultihostFixture object at 0x7fd6cd899eb8>

@classmethod
def install(cls, mh):
super(TestReplicaInstall, cls).install(mh)
cls.create_pkcs12('ca1/server')
cls.prepare_cacert('ca1')
result = cls.install_server()
> assert result.returncode == 0
E assert 1 == 0
E + where 1 = <pytest_multihost.transport.SSHCommand object at 0x7fd6ce1fa828>.returncode

/usr/lib/python3.6/site-packages/ipatests/test_integration/test_caless.py:799: AssertionError
Error test_caless.py::TestReplicaInstall::()::test_wildcard_http::setup 0.00
cls = <class 'ipatests.test_integration.test_caless.TestReplicaInstall'>
mh = <pytest_multihost.plugin.MultihostFixture object at 0x7fd6cd899eb8>

@classmethod
def install(cls, mh):
super(TestReplicaInstall, cls).install(mh)
cls.create_pkcs12('ca1/server')
cls.prepare_cacert('ca1')
result = cls.install_server()
> assert result.returncode == 0
E assert 1 == 0
E + where 1 = <pytest_multihost.transport.SSHCommand object at 0x7fd6ce1fa828>.returncode

/usr/lib/python3.6/site-packages/ipatests/test_integration/test_caless.py:799: AssertionError
Error test_caless.py::TestReplicaInstall::()::test_wildcard_ds::setup 0.00
cls = <class 'ipatests.test_integration.test_caless.TestReplicaInstall'>
mh = <pytest_multihost.plugin.MultihostFixture object at 0x7fd6cd899eb8>

@classmethod
def install(cls, mh):
super(TestReplicaInstall, cls).install(mh)
cls.create_pkcs12('ca1/server')
cls.prepare_cacert('ca1')
result = cls.install_server()
> assert result.returncode == 0
E assert 1 == 0
E + where 1 = <pytest_multihost.transport.SSHCommand object at 0x7fd6ce1fa828>.returncode

/usr/lib/python3.6/site-packages/ipatests/test_integration/test_caless.py:799: AssertionError
Error test_caless.py::TestReplicaInstall::()::test_http_san::setup 0.00
cls = <class 'ipatests.test_integration.test_caless.TestReplicaInstall'>
mh = <pytest_multihost.plugin.MultihostFixture object at 0x7fd6cd899eb8>

@classmethod
def install(cls, mh):
super(TestReplicaInstall, cls).install(mh)
cls.create_pkcs12('ca1/server')
cls.prepare_cacert('ca1')
result = cls.install_server()
> assert result.returncode == 0
E assert 1 == 0
E + where 1 = <pytest_multihost.transport.SSHCommand object at 0x7fd6ce1fa828>.returncode

/usr/lib/python3.6/site-packages/ipatests/test_integration/test_caless.py:799: AssertionError
Error test_caless.py::TestReplicaInstall::()::test_ds_san::setup 0.00
cls = <class 'ipatests.test_integration.test_caless.TestReplicaInstall'>
mh = <pytest_multihost.plugin.MultihostFixture object at 0x7fd6cd899eb8>

@classmethod
def install(cls, mh):
super(TestReplicaInstall, cls).install(mh)
cls.create_pkcs12('ca1/server')
cls.prepare_cacert('ca1')
result = cls.install_server()
> assert result.returncode == 0
E assert 1 == 0
E + where 1 = <pytest_multihost.transport.SSHCommand object at 0x7fd6ce1fa828>.returncode

/usr/lib/python3.6/site-packages/ipatests/test_integration/test_caless.py:799: AssertionError
Error test_caless.py::TestReplicaInstall::()::test_interactive_missing_http_pkcs_password::setup 0.00
cls = <class 'ipatests.test_integration.test_caless.TestReplicaInstall'>
mh = <pytest_multihost.plugin.MultihostFixture object at 0x7fd6cd899eb8>

@classmethod
def install(cls, mh):
super(TestReplicaInstall, cls).install(mh)
cls.create_pkcs12('ca1/server')
cls.prepare_cacert('ca1')
result = cls.install_server()
> assert result.returncode == 0
E assert 1 == 0
E + where 1 = <pytest_multihost.transport.SSHCommand object at 0x7fd6ce1fa828>.returncode

/usr/lib/python3.6/site-packages/ipatests/test_integration/test_caless.py:799: AssertionError
Error test_caless.py::TestReplicaInstall::()::test_interactive_missing_ds_pkcs_password::setup 0.00
cls = <class 'ipatests.test_integration.test_caless.TestReplicaInstall'>
mh = <pytest_multihost.plugin.MultihostFixture object at 0x7fd6cd899eb8>

@classmethod
def install(cls, mh):
super(TestReplicaInstall, cls).install(mh)
cls.create_pkcs12('ca1/server')
cls.prepare_cacert('ca1')
result = cls.install_server()
> assert result.returncode == 0
E assert 1 == 0
E + where 1 = <pytest_multihost.transport.SSHCommand object at 0x7fd6ce1fa828>.returncode

/usr/lib/python3.6/site-packages/ipatests/test_integration/test_caless.py:799: AssertionError
Error test_caless.py::TestReplicaInstall::()::test_no_http_password::setup 0.00
cls = <class 'ipatests.test_integration.test_caless.TestReplicaInstall'>
mh = <pytest_multihost.plugin.MultihostFixture object at 0x7fd6cd899eb8>

@classmethod
def install(cls, mh):
super(TestReplicaInstall, cls).install(mh)
cls.create_pkcs12('ca1/server')
cls.prepare_cacert('ca1')
result = cls.install_server()
> assert result.returncode == 0
E assert 1 == 0
E + where 1 = <pytest_multihost.transport.SSHCommand object at 0x7fd6ce1fa828>.returncode

/usr/lib/python3.6/site-packages/ipatests/test_integration/test_caless.py:799: AssertionError
Error test_caless.py::TestReplicaInstall::()::test_no_ds_password::setup 0.00
cls = <class 'ipatests.test_integration.test_caless.TestReplicaInstall'>
mh = <pytest_multihost.plugin.MultihostFixture object at 0x7fd6cd899eb8>

@classmethod
def install(cls, mh):
super(TestReplicaInstall, cls).install(mh)
cls.create_pkcs12('ca1/server')
cls.prepare_cacert('ca1')
result = cls.install_server()
> assert result.returncode == 0
E assert 1 == 0
E + where 1 = <pytest_multihost.transport.SSHCommand object at 0x7fd6ce1fa828>.returncode

/usr/lib/python3.6/site-packages/ipatests/test_integration/test_caless.py:799: AssertionError
Error test_caless.py::TestReplicaInstall::()::test_certs_with_no_password::setup 0.00
cls = <class 'ipatests.test_integration.test_caless.TestReplicaInstall'>
mh = <pytest_multihost.plugin.MultihostFixture object at 0x7fd6cd899eb8>

@classmethod
def install(cls, mh):
super(TestReplicaInstall, cls).install(mh)
cls.create_pkcs12('ca1/server')
cls.prepare_cacert('ca1')
result = cls.install_server()
> assert result.returncode == 0
E assert 1 == 0
E + where 1 = <pytest_multihost.transport.SSHCommand object at 0x7fd6ce1fa828>.returncode

/usr/lib/python3.6/site-packages/ipatests/test_integration/test_caless.py:799: AssertionError
Error test_caless.py::TestReplicaInstall::()::test_certs_with_no_password_interactive::setup 0.00
cls = <class 'ipatests.test_integration.test_caless.TestReplicaInstall'>
mh = <pytest_multihost.plugin.MultihostFixture object at 0x7fd6cd899eb8>

@classmethod
def install(cls, mh):
super(TestReplicaInstall, cls).install(mh)
cls.create_pkcs12('ca1/server')
cls.prepare_cacert('ca1')
result = cls.install_server()
> assert result.returncode == 0
E assert 1 == 0
E + where 1 = <pytest_multihost.transport.SSHCommand object at 0x7fd6ce1fa828>.returncode

/usr/lib/python3.6/site-packages/ipatests/test_integration/test_caless.py:799: AssertionError